program: Orca
programVersion: 5.0.2
elementType: S O O O N N C C C C C C C C C C C C C C C C C C C C H H H H H H H H H H H H H H H H H H H H H H H H H H H H H H H H
charge: 0
multiplicity: 1
keywords: wb97x-d3
keywords: def2-TZVPP
keywords: def2/J RIJCOSX
keywords: DEFGRID2
keywords: scfconv7
keywords: smallprint printgap noloewdin
keywords: NOSOSCF
formula: C20H32N2O3S
InChI: InChI=1/C20H32N2O3S/c1-6-8-13-22(14-9-7-2)26-21(5)19(23)24-17-12-10-11-16-15-20(3,4)25-18(16)17/h10-12H,6-9,13-15H2,1-5H3
58 atoms
S  -1.84548 1.952682 1.024111
O  1.493059 -1.329453 -0.112391
O  0.7852 1.00896 1.386461
O  0.306297 -0.782832 2.666536
N  -2.31866 1.330767 -0.442483
N  -1.341901 0.6413 2.008369
C  2.184533 -2.531382 -0.537528
C  3.674679 -2.121484 -0.614004
C  3.706265 -0.900522 0.256081
C  2.391738 -0.525358 0.476518
C  1.603849 -2.945907 -1.873666
C  1.962093 -3.588589 0.534012
C  4.743949 -0.149234 0.771782
C  2.081911 0.596714 1.223497
C  4.44157 0.985092 1.518198
C  3.121036 1.351177 1.743975
C  -3.596963 0.633134 -0.517783
C  -1.278903 0.822406 -1.333531
C  -4.394784 1.028428 -1.755146
C  -0.334909 1.908305 -1.824949
C  -5.745199 0.323039 -1.853484
C  0.844812 1.356634 -2.619572
C  -0.049145 0.192635 2.065826
C  -5.648312 -1.177857 -2.099284
C  0.454575 0.594106 -3.879231
C  -2.335989 -0.145032 2.721227
H  3.975544 -1.880403 -1.638689
H  4.328341 -2.922697 -0.264972
H  0.540455 -3.172145 -1.78798
H  2.106643 -3.841119 -2.240676
H  1.726775 -2.159107 -2.619162
H  0.899199 -3.787668 0.669703
H  2.3661 -3.26747 1.49508
H  2.451439 -4.52284 0.254765
H  5.774007 -0.431952 0.596711
H  5.237605 1.58777 1.93296
H  2.887221 2.232594 2.326481
H  -4.178441 0.895234 0.368005
H  -3.44344 -0.453545 -0.481065
H  -1.785877 0.372092 -2.189284
H  -0.713221 0.010278 -0.860348
H  -4.543597 2.110306 -1.726803
H  -3.819191 0.823545 -2.663331
H  -0.901364 2.61933 -2.434132
H  0.048456 2.466817 -0.968982
H  -6.315952 0.779047 -2.665839
H  -6.323293 0.509966 -0.943198
H  1.498184 2.188492 -2.892999
H  1.440665 0.708516 -1.972406
H  -5.064599 -1.392349 -2.996404
H  -6.6357 -1.618051 -2.238946
H  -5.177196 -1.704116 -1.268684
H  1.336153 0.302698 -4.451411
H  -0.173513 1.201311 -4.534061
H  -0.095416 -0.320252 -3.651227
H  -3.231885 0.459258 2.836238
H  -1.974295 -0.423533 3.709051
H  -2.595807 -1.058684 2.183371
totalener: -1514.90007511 hartree
nucrepener: 2782.55371113 hartree
electener: -4297.45378624 hartree
oneelecener: -7603.13314988 hartree
twoeener: 3305.67936364 hartree
kineticenergy: 1509.13973892 hartree
xcener: -129.017549935954 hartree
chargesum: -0.0000000
charge: 0.040260 -0.324150 -0.306684 -0.377559 -0.117059 -0.176927 0.326720 -0.163621 -0.050034 0.268565 -0.286342 -0.290413 -0.154552 0.092829 -0.112749 -0.180003 -0.117551 -0.163537 -0.112347 -0.097653 -0.105519 -0.084523 0.421239 -0.250938 -0.290354 -0.178068 0.079279 0.090666 0.095212 0.096615 0.085721 0.092720 0.114102 0.083852 0.116609 0.119472 0.120526 0.084307 0.091131 0.096546 0.098731 0.075571 0.059853 0.071204 0.084200 0.070093 0.053043 0.072421 0.041584 0.075135 0.087968 0.070813 0.090733 0.087989 0.068794 0.096358 0.116764 0.102953
qa: 0.0403 -0.3241 -0.3067 -0.3776 -0.1171 -0.1769 0.3267 -0.1636 -0.0500 0.2686 -0.2863 -0.2904 -0.1546 0.0928 -0.1127 -0.1800 -0.1176 -0.1635 -0.1123 -0.0977 -0.1055 -0.0845 0.4212 -0.2509 -0.2904 -0.1781 0.0793 0.0907 0.0952 0.0966 0.0857 0.0927 0.1141 0.0839 0.1166 0.1195 0.1205 0.0843 0.0911 0.0965 0.0987 0.0756 0.0599 0.0712 0.0842 0.0701 0.0530 0.0724 0.0416 0.0751 0.0880 0.0708 0.0907 0.0880 0.0688 0.0964 0.1168 0.1030
va: 2.3484 2.0756 2.0806 2.1368 3.0218 3.1518 3.8216 4.0169 3.6982 3.8556 3.9291 3.9708 4.0156 3.8855 3.9349 4.0576 3.9300 3.9468 3.8792 3.8399 3.8919 3.8751 4.3056 3.9265 3.9335 3.9030 1.0049 1.0029 1.0089 1.0089 1.0034 1.0149 1.0035 1.0063 1.0052 1.0010 1.0067 1.0133 0.9897 0.9875 1.0219 1.0251 1.0182 1.0180 1.0305 1.0080 1.0092 1.0119 1.0242 1.0039 1.0062 1.0047 1.0042 1.0058 0.9973 1.0096 1.0076 0.9882
dispcorr: -0.033348418 hartree
energy: -1514.933423527818
dipole: -19.37342 19.24112 -0.13230 -13.47320 12.79370 -0.67950 -28.77786 27.80592 -0.97195
magnitude: 1.19328 au
magnitude: 3.03307 debye
