program: Orca
programVersion: 5.0.2
elementType: S O O O N N C C C C C C C C C C C C C C C C C C C C H H H H H H H H H H H H H H H H H H H H H H H H H H H H H H H H
charge: 0
multiplicity: 1
keywords: wb97x-d3
keywords: def2-TZVPP
keywords: def2/J RIJCOSX
keywords: DEFGRID2
keywords: scfconv7
keywords: smallprint printgap noloewdin
keywords: NOSOSCF
formula: C20H32N2O3S
InChI: InChI=1/C20H32N2O3S/c1-6-8-13-22(14-9-7-2)26-21(5)19(23)24-17-12-10-11-16-15-20(3,4)25-18(16)17/h10-12H,6-9,13-15H2,1-5H3
58 atoms
S  -1.904496 1.393327 0.423466
O  1.841055 -1.6727 0.019868
O  0.758268 0.73771 1.109248
O  0.300206 -0.649152 2.82219
N  -2.342424 0.336539 -0.784759
N  -1.377637 0.451715 1.754723
C  2.737006 -2.588603 -0.659692
C  4.119122 -2.35996 -0.001926
C  3.940851 -1.018811 0.64319
C  2.585106 -0.734923 0.626675
C  2.763364 -2.197956 -2.130164
C  2.199115 -3.99049 -0.458228
C  4.833529 -0.138649 1.221938
C  2.09262 0.427749 1.189015
C  4.346119 1.035628 1.786386
C  2.985414 1.31062 1.775091
C  -3.576456 -0.419832 -0.612174
C  -1.273228 -0.362036 -1.492951
C  -4.793626 0.445314 -0.325368
C  -0.276998 0.570306 -2.159906
C  -5.06352 1.501999 -1.389067
C  -0.898734 1.517714 -3.177242
C  -0.070191 0.101924 1.96432
C  -6.32663 2.300679 -1.103214
C  0.145181 2.389895 -3.859093
C  -2.345115 -0.088341 2.698708
H  4.923387 -2.385657 -0.739423
H  4.340903 -3.126785 0.746741
H  3.418324 -2.866262 -2.690667
H  3.131888 -1.179073 -2.261983
H  1.766668 -2.25762 -2.569119
H  2.842699 -4.716101 -0.956084
H  1.196757 -4.09231 -0.874959
H  2.155163 -4.245533 0.600411
H  5.894102 -0.354527 1.236461
H  5.02714 1.740387 2.24294
H  2.606907 2.224756 2.213474
H  -3.472996 -1.191422 0.163486
H  -3.749348 -0.9553 -1.550196
H  -1.755836 -0.968074 -2.265627
H  -0.744162 -1.062716 -0.835376
H  -5.655672 -0.224552 -0.247227
H  -4.698957 0.926529 0.651562
H  0.267823 1.141361 -1.406648
H  0.470659 -0.058721 -2.653411
H  -5.144637 1.01844 -2.367514
H  -4.210006 2.178911 -1.459848
H  -1.445504 0.940988 -3.930299
H  -1.641508 2.149318 -2.685078
H  -7.205244 1.655227 -1.051685
H  -6.511988 3.046329 -1.876511
H  -6.252199 2.828463 -0.151006
H  0.686645 2.997002 -3.131761
H  -0.307617 3.068427 -4.582404
H  0.881868 1.785382 -4.391571
H  -2.479552 -1.163662 2.574246
H  -3.298027 0.405747 2.531124
H  -2.034123 0.09777 3.725753
totalener: -1514.90102889 hartree
nucrepener: 2761.14213073 hartree
electener: -4276.04315962 hartree
oneelecener: -7560.35884159 hartree
twoeener: 3284.31568197 hartree
kineticenergy: 1509.15375144 hartree
xcener: -129.019947070690 hartree
chargesum: 0.0000000
charge: 0.041852 -0.329413 -0.314747 -0.373616 -0.126166 -0.172542 0.339969 -0.151436 -0.094247 0.338210 -0.336204 -0.272873 -0.148271 0.071660 -0.121833 -0.160848 -0.139403 -0.135678 -0.126661 -0.122465 -0.048210 -0.049289 0.414501 -0.265947 -0.264928 -0.187020 0.086953 0.083752 0.096781 0.113582 0.087752 0.086901 0.091676 0.095923 0.117210 0.119187 0.117414 0.100804 0.085881 0.083977 0.105666 0.069193 0.065623 0.077321 0.057054 0.053449 0.050985 0.048017 0.052676 0.071349 0.084926 0.076580 0.078527 0.083363 0.069374 0.107495 0.099453 0.116758
qa: 0.0419 -0.3294 -0.3147 -0.3736 -0.1262 -0.1725 0.3400 -0.1514 -0.0942 0.3382 -0.3362 -0.2729 -0.1483 0.0717 -0.1218 -0.1608 -0.1394 -0.1357 -0.1267 -0.1225 -0.0482 -0.0493 0.4145 -0.2659 -0.2649 -0.1870 0.0870 0.0838 0.0968 0.1136 0.0878 0.0869 0.0917 0.0959 0.1172 0.1192 0.1174 0.1008 0.0859 0.0840 0.1057 0.0692 0.0656 0.0773 0.0571 0.0534 0.0510 0.0480 0.0527 0.0713 0.0849 0.0766 0.0785 0.0834 0.0694 0.1075 0.0995 0.1168
va: 2.3692 2.1056 2.0796 2.1440 2.9771 3.1737 3.7649 4.0091 3.7218 3.8816 3.9735 3.9425 4.0043 3.8543 3.9499 4.0704 3.9457 3.9261 3.8676 3.8693 3.8503 3.8713 4.3123 3.9606 3.9600 3.9106 1.0029 1.0043 1.0130 0.9963 1.0076 1.0042 1.0084 1.0103 1.0052 1.0015 1.0063 0.9933 1.0024 1.0004 1.0168 1.0168 1.0212 1.0229 1.0163 1.0102 1.0229 1.0100 1.0201 1.0027 1.0055 1.0022 1.0031 1.0056 1.0029 0.9921 0.9998 1.0049
dispcorr: -0.032262415 hartree
energy: -1514.933291308676
dipole: -20.38080 20.45682 0.07602 -2.54745 1.79662 -0.75083 -25.93681 25.03197 -0.90484
magnitude: 1.17825 au
magnitude: 2.99487 debye
