program: Orca
programVersion: 5.0.2
elementType: S O O O N N C C C C C C C C C C C C C C C C C C C C H H H H H H H H H H H H H H H H H H H H H H H H H H H H H H H H
charge: 0
multiplicity: 1
keywords: wb97x-d3
keywords: def2-TZVPP
keywords: def2/J RIJCOSX
keywords: DEFGRID2
keywords: scfconv7
keywords: smallprint printgap noloewdin
keywords: NOSOSCF
formula: C20H32N2O3S
InChI: InChI=1/C20H32N2O3S/c1-6-8-13-22(14-9-7-2)26-21(5)19(23)24-17-12-10-11-16-15-20(3,4)25-18(16)17/h10-12H,6-9,13-15H2,1-5H3
58 atoms
S  -1.689196 2.248209 0.571295
O  0.910555 -1.719142 -0.079002
O  0.75637 0.899189 1.023964
O  0.071546 -0.434259 2.705194
N  -2.073652 1.53561 -0.86608
N  -1.37174 1.035811 1.74943
C  1.297596 -3.106278 -0.257166
C  2.842139 -3.074157 -0.358059
C  3.167128 -1.756632 0.280318
C  1.979104 -1.054878 0.389201
C  0.624078 -3.616589 -1.513588
C  0.842657 -3.864411 0.980297
C  4.352874 -1.189084 0.704376
C  1.939922 0.210547 0.943811
C  4.325464 0.092029 1.246395
C  3.126744 0.783316 1.369896
C  -3.436061 1.09052 -1.111966
C  -1.008799 1.089039 -1.761446
C  -3.86832 -0.210816 -0.441741
C  0.010925 2.169587 -2.085273
C  -3.035985 -1.447347 -0.763122
C  -0.587072 3.402456 -2.747892
C  -0.1604 0.419947 1.895121
C  -3.118142 -1.886744 -2.218871
C  0.468139 4.435186 -3.115006
C  -2.399436 0.642751 2.701386
H  3.179491 -3.103239 -1.399064
H  3.293262 -3.926765 0.152401
H  0.899537 -4.656534 -1.691206
H  0.921158 -3.034236 -2.386133
H  -0.461954 -3.570275 -1.424802
H  1.313136 -3.467475 1.880749
H  1.101244 -4.920986 0.897552
H  -0.237233 -3.78643 1.106501
H  5.2877 -1.728067 0.618838
H  5.241586 0.55411 1.587375
H  3.105595 1.77382 1.804898
H  -3.558893 1.013294 -2.19568
H  -4.113295 1.884715 -0.788324
H  -1.494064 0.781521 -2.691598
H  -0.499545 0.202295 -1.374748
H  -3.884292 -0.06119 0.639135
H  -4.910476 -0.392864 -0.72696
H  0.550315 2.45636 -1.180377
H  0.756829 1.72013 -2.748608
H  -3.386722 -2.26652 -0.129312
H  -1.994581 -1.282197 -0.476167
H  -1.136212 3.10348 -3.646731
H  -1.324829 3.855613 -2.081864
H  -2.55831 -2.807381 -2.385993
H  -2.71175 -1.140214 -2.901754
H  -4.151353 -2.074812 -2.516668
H  1.012579 4.772061 -2.2316
H  0.023622 5.314149 -3.582262
H  1.200527 4.026595 -3.813225
H  -2.05626 0.777883 3.726683
H  -2.688906 -0.401451 2.577452
H  -3.270371 1.272079 2.542585
totalener: -1514.89855532 hartree
nucrepener: 2833.58618968 hartree
electener: -4348.48474500 hartree
oneelecener: -7705.27864439 hartree
twoeener: 3356.79389938 hartree
kineticenergy: 1509.14607519 hartree
xcener: -129.024650821826 hartree
chargesum: 0.0000000
charge: 0.032864 -0.333635 -0.317778 -0.379776 -0.130483 -0.165584 0.320783 -0.146401 -0.078528 0.308409 -0.285290 -0.295987 -0.161804 0.103407 -0.104638 -0.181467 -0.125652 -0.111350 -0.145635 -0.138902 -0.054941 -0.061893 0.420671 -0.262940 -0.261914 -0.190222 0.079853 0.088662 0.096967 0.092436 0.081722 0.116316 0.085233 0.092693 0.116520 0.118740 0.118145 0.085468 0.102562 0.089984 0.084601 0.081521 0.073703 0.077474 0.067126 0.076456 0.025728 0.048274 0.056534 0.081936 0.075829 0.084980 0.077474 0.082133 0.070185 0.120333 0.104645 0.094450
qa: 0.0329 -0.3336 -0.3178 -0.3798 -0.1305 -0.1656 0.3208 -0.1464 -0.0785 0.3084 -0.2853 -0.2960 -0.1618 0.1034 -0.1046 -0.1815 -0.1257 -0.1114 -0.1456 -0.1389 -0.0549 -0.0619 0.4207 -0.2629 -0.2619 -0.1902 0.0799 0.0887 0.0970 0.0924 0.0817 0.1163 0.0852 0.0927 0.1165 0.1187 0.1181 0.0855 0.1026 0.0900 0.0846 0.0815 0.0737 0.0775 0.0671 0.0765 0.0257 0.0483 0.0565 0.0819 0.0758 0.0850 0.0775 0.0821 0.0702 0.1203 0.1046 0.0944
va: 2.3844 2.1005 2.0702 2.1352 2.9604 3.1499 3.8228 3.9976 3.7136 3.9089 3.9267 3.9821 4.0162 3.8366 3.9261 4.0833 3.9416 3.9316 3.8771 3.9144 3.8365 3.8585 4.3040 3.9340 3.9578 3.9168 1.0044 1.0033 1.0088 1.0094 1.0124 1.0037 1.0069 1.0106 1.0058 1.0012 1.0072 0.9959 1.0137 0.9982 1.0127 1.0126 1.0201 1.0233 1.0143 1.0068 1.0307 1.0096 1.0204 1.0089 1.0024 1.0056 1.0030 1.0056 1.0028 1.0035 0.9854 1.0094
dispcorr: -0.035112987 hartree
energy: -1514.933668306392
dipole: -15.24809 15.05460 -0.19349 -8.32724 7.50160 -0.82564 -22.75764 21.88067 -0.87697
magnitude: 1.21992 au
magnitude: 3.10079 debye
