program: Gaussian 09
title: 000065119
version: EM64L-G09RevD.01
frameworkgroup: C1[X(C10H14N2O4)]
method: RPBEPBE
basis: SDD
operation: Freq
keyword: #p
keyword: freq=noraman
keyword: PBEPBE/SDD
title: #p freq=noraman PBEPBE/SDD
converged: YES YES NO NO
title: Mulliken charges:
elementType: O O O O N N C C C C C C C C C C H H H H H H H H H H H H H H
charge: -0.270527 -0.442481 -0.278248 -0.250009 -0.173688 -0.398841 -0.011065 -0.491188 -0.471003 -0.087484 -0.341881 -0.235477 0.202170 0.226792 0.089328 -0.771227 0.275509 0.237921 0.280475 0.247959 0.227367 0.239087 0.230773 0.217271 0.332971 0.356400 0.348626 0.242127 0.226874 0.241467
chargesum: 0.00000
title: Mulliken charges with hydrogens summed into heavy atoms:
elementType: O O O O N N C C C C C C C C C C
charge: -0.270527 -0.093855 -0.278248 -0.250009 -0.173688 -0.042441 0.264444 0.027208 0.004323 0.151603 0.106164 0.097494 0.202170 0.226792 0.089328 -0.060759
polarizability: 1.71282480e+02 1.29920831e+01 1.44961671e+02 4.97062226e+00 -5.59393331e-01 8.44211451e+01
1716.lowfreq: -12.9205 -2.6003 -0.0008 -0.0008 -0.0003 9.1582 25.3747 54.4639 74.1372
frequency: 24.2884 54.4283 74.1021 106.5438 128.0270 130.9692 144.3974 177.2869 186.5814 231.7074 258.2417 278.8215 287.8877 299.7189 361.1212 379.1663 386.2688 440.2774 464.9948 483.9328 546.1021 589.2294 627.8077 688.2104 704.9261 711.3857 716.9001 745.8785 776.9121 789.4428 832.7416 846.8629 910.3356 929.7319 935.3238 952.0062 988.2190 1011.1198 1020.8376 1044.0180 1051.7906 1058.6883 1088.0780 1098.2957 1132.5356 1148.2708 1183.1517 1210.6636 1229.9057 1246.5651 1254.7163 1280.7074 1298.3834 1300.4637 1323.2436 1341.5996 1350.3816 1371.6734 1378.4331 1384.3434 1404.5630 1418.1465 1454.4255 1463.1887 1467.4926 1473.1097 1479.8989 1612.8300 1627.3692 1656.8084 2959.4815 2985.0876 3018.0931 3028.2679 3034.8573 3058.4066 3064.1040 3070.8131 3085.2722 3097.9533 3114.1341 3130.3060 3526.0336 3566.5089
redmass: 3.7904 5.3828 5.8953 3.1444 2.3588 1.4406 3.6919 3.1219 3.9418 2.2643 4.2777 3.3546 2.6382 2.2905 3.1244 8.9851 4.2187 4.0393 6.8097 3.2944 4.1686 3.9032 3.3394 3.4631 2.2981 4.4234 6.3754 7.0948 2.3581 3.1861 3.1522 2.0784 2.3119 2.5301 2.6131 1.3656 2.2969 2.0268 2.2098 3.1907 1.8810 1.7051 1.9307 2.8991 4.2256 1.4376 1.4366 1.4746 4.9328 1.4798 1.5280 1.4941 1.4547 1.3326 1.3413 1.7530 1.2730 1.8092 1.5773 1.2594 1.2620 3.0213 1.0456 1.0852 1.0822 1.0806 1.0906 5.4865 10.4056 5.7701 1.0679 1.0364 1.0691 1.0707 1.0729 1.0877 1.0973 1.0960 1.1037 1.1007 1.1023 1.0967 1.0769 1.0662
irintensity: 0.8233 0.7431 3.0064 3.6557 1.2745 1.7321 3.1260 2.3578 13.8020 17.0526 6.3908 29.6638 46.2492 84.7397 2.8954 11.6535 4.6546 6.1150 15.8218 23.4797 12.7789 2.7090 1.5406 10.0946 4.2559 10.9434 4.3358 7.8786 102.8808 24.5390 0.8249 8.7265 26.6535 24.0975 42.4708 12.3421 26.7148 24.5743 14.6608 67.1876 46.1259 43.9270 25.5988 38.6810 14.5998 10.8921 28.1765 3.7030 7.5384 80.7702 69.4752 19.1128 75.0971 7.1687 1.6732 43.5050 11.6574 22.4694 10.3907 10.0144 22.6912 76.0508 12.1493 8.0898 7.2437 4.5896 18.7002 185.4590 299.4864 567.4155 59.2620 23.0198 13.4060 38.2268 15.3507 7.5222 15.9179 43.1446 16.0208 13.3149 16.4026 62.3771 53.2899 9.7119
temp: 298.150 k
press: 1.00000 atm
elementType: 8 8 8 8 7 7 6 6 6 6 6 6 6 6 6 6 1 1 1 1 1 1 1 1 1 1 1 1 1 1
symmnumber: 1
zpe: 626818.1 jmol-1
zpe.correction: 0.238742 hartree
zpe.thermalcorrener: 0.254085 hartree
zpe.thermalcorrenthalpy: 0.255029 hartree
zpe.thermalcorrgfe: 0.195584 hartree
zpe.sumelectzpe: -798.663082 hartree
zpe.sumelectthermal: -798.647739 hartree
zpe.sumelectthermalent: -798.646795 hartree
zpe.sumelectthermalfe: -798.706240 hartree
dipole: -7.4429 0.9028 0.6615
dipole: 7.5266
quadrupole: -95.3440 -101.3026 -93.5271
quadrupole: -2.6986 -3.0319 -4.0281
quadrupole: 1.3805 -4.5780 3.1974 -2.6986 -3.0319 -4.0281
hfenergy: -798.9018244 hartree
pointgroup: C01 [X(C10H14N2O4)]
dipole: 2.9503541 0.0802899 -0.2401659 debye
polarizability: 168.4952785|-15.4361075|147.6215276|5.0109176|2.0180831|84.5484898 unknown
InChI: InChI=1S/C10H14N2O4/c1-6-4-12(10(15)11-9(6)14)8-3-2-7(5-13)16-8/h4,7-8,11,13H,2-3,5H2,1H3
charge 0 multiplicity 1
30 atoms
O  1.959934 -0.263485 1.067313
O  2.437772 2.41586 0.154585
O  -1.189505 -2.741249 0.006109
O  -4.045557 0.947239 -0.409118
N  -0.274128 -0.584156 0.195538
N  -2.583023 -0.858197 -0.175938
C  1.068232 -1.218428 0.411131
C  1.761977 -1.656838 -0.908996
C  3.247125 -1.26151 -0.694164
C  3.138652 -0.000471 0.19266
C  2.965693 1.295385 -0.631026
C  -0.452255 0.802719 0.181866
C  -1.345106 -1.484316 0.010577
C  -1.679538 1.395476 -0.019602
C  -2.860482 0.544091 -0.217313
C  -1.871118 2.892422 -0.028834
H  0.899135 -2.071066 1.089113
H  1.320779 -1.111395 -1.761486
H  1.622012 -2.733301 -1.088098
H  3.787522 -2.057154 -0.153269
H  3.773251 -1.070469 -1.645902
H  3.98435 0.112608 0.896046
H  2.231458 1.15992 -1.443243
H  3.945175 1.555855 -1.086851
H  0.451029 1.394001 0.368325
H  -3.382795 -1.485333 -0.309201
H  2.946366 2.500494 1.000401
H  -2.352565 3.21853 -0.968594
H  -0.906655 3.416799 0.079192
H  -2.543634 3.208172 0.78988
