program: Orca
programVersion: 5.0.2
elementType: S O O O N N C C C C C C C C C C C C C C C C C C C C H H H H H H H H H H H H H H H H H H H H H H H H H H H H H H H H
charge: 0
multiplicity: 1
keywords: wb97x-d3
keywords: def2-TZVPP
keywords: def2/J RIJCOSX
keywords: DEFGRID2
keywords: scfconv7
keywords: smallprint printgap noloewdin
keywords: NOSOSCF
formula: C20H32N2O3S
InChI: InChI=1/C20H32N2O3S/c1-6-8-13-22(14-9-7-2)26-21(5)19(23)24-17-12-10-11-16-15-20(3,4)25-18(16)17/h10-12H,6-9,13-15H2,1-5H3
58 atoms
S  -1.32285 2.312543 0.843283
O  1.332786 -1.599517 -0.193077
O  0.344481 0.232751 1.770463
O  2.314924 1.081452 1.085276
N  -1.874884 1.761468 -0.622378
N  0.390959 2.265015 0.81122
C  2.146136 -2.599635 -0.857824
C  2.29713 -3.741609 0.176612
C  1.947762 -3.05108 1.46074
C  1.393809 -1.826812 1.127909
C  3.48861 -1.954742 -1.165543
C  1.41546 -3.022775 -2.115501
C  2.046812 -3.437143 2.783137
C  0.940983 -0.956039 2.10211
C  1.583708 -2.572049 3.768926
C  1.039958 -1.340037 3.429389
C  -1.771255 0.331991 -0.903712
C  -1.761813 2.633879 -1.784143
C  -2.599075 -0.524638 0.039898
C  -3.045703 2.660895 -2.60619
C  -2.394584 -2.020106 -0.182238
C  -2.90995 3.433344 -3.915248
C  1.125068 1.177008 1.201783
C  -2.79544 -2.509296 -1.568119
C  -2.603524 4.91492 -3.737634
C  1.128561 3.365003 0.209907
H  3.306382 -4.156945 0.168054
H  1.605973 -4.565774 -0.026658
H  3.984688 -1.625332 -0.251651
H  3.362967 -1.084031 -1.808891
H  4.145195 -2.662391 -1.673721
H  1.990569 -3.780302 -2.648758
H  1.270748 -2.178146 -2.790057
H  0.437233 -3.444218 -1.880441
H  2.472285 -4.395844 3.050506
H  1.65236 -2.852647 4.810796
H  0.684771 -0.665947 4.197708
H  -0.724869 0.002342 -0.899157
H  -2.125386 0.184048 -1.926162
H  -0.915671 2.330431 -2.418157
H  -1.537175 3.639535 -1.427967
H  -2.337716 -0.282864 1.071495
H  -3.655398 -0.266494 -0.083679
H  -3.360623 1.638916 -2.833652
H  -3.842277 3.094039 -1.994945
H  -2.971639 -2.56329 0.56967
H  -1.347496 -2.271523 0.00419
H  -2.132826 2.970393 -4.531468
H  -3.83952 3.327324 -4.479577
H  -2.722256 -3.595031 -1.639727
H  -2.157455 -2.094167 -2.349858
H  -3.825568 -2.235169 -1.804284
H  -1.627187 5.083021 -3.281722
H  -3.349097 5.398783 -3.104274
H  -2.601732 5.433564 -4.69642
H  2.027419 3.587123 0.781797
H  0.490161 4.244513 0.21022
H  1.424069 3.14582 -0.817684
totalener: -1514.90040047 hartree
nucrepener: 2772.04986536 hartree
electener: -4286.95026583 hartree
oneelecener: -7582.13579392 hartree
twoeener: 3295.18552809 hartree
kineticenergy: 1509.14563700 hartree
xcener: -129.018399861874 hartree
chargesum: -0.0000000
charge: 0.039304 -0.324324 -0.309791 -0.378427 -0.121460 -0.175406 0.320469 -0.162512 -0.057381 0.282854 -0.289301 -0.284983 -0.150771 0.086915 -0.115480 -0.175735 -0.166320 -0.110034 -0.096734 -0.102096 -0.085161 -0.109117 0.420935 -0.288838 -0.257831 -0.181846 0.090076 0.079986 0.115167 0.091874 0.083013 0.097432 0.094230 0.087029 0.117138 0.119091 0.120085 0.099606 0.095296 0.088681 0.083655 0.084175 0.071890 0.067673 0.066247 0.072641 0.038131 0.054445 0.069284 0.089117 0.071350 0.087379 0.072600 0.079803 0.087291 0.116468 0.096409 0.105811
qa: 0.0393 -0.3243 -0.3098 -0.3784 -0.1215 -0.1754 0.3205 -0.1625 -0.0574 0.2829 -0.2893 -0.2850 -0.1508 0.0869 -0.1155 -0.1757 -0.1663 -0.1100 -0.0967 -0.1021 -0.0852 -0.1091 0.4209 -0.2888 -0.2578 -0.1818 0.0901 0.0800 0.1152 0.0919 0.0830 0.0974 0.0942 0.0870 0.1171 0.1191 0.1201 0.0996 0.0953 0.0887 0.0837 0.0842 0.0719 0.0677 0.0662 0.0726 0.0381 0.0544 0.0693 0.0891 0.0713 0.0874 0.0726 0.0798 0.0873 0.1165 0.0964 0.1058
va: 2.3511 2.0779 2.0804 2.1356 3.0343 3.1514 3.8220 4.0190 3.7112 3.8604 3.9728 3.9312 4.0126 3.8855 3.9400 4.0599 3.9440 3.9327 3.8414 3.8590 3.8776 3.8898 4.3050 3.9336 3.9372 3.9030 1.0027 1.0048 1.0033 1.0142 1.0066 1.0087 1.0095 1.0032 1.0051 1.0012 1.0063 1.0216 0.9884 0.9918 1.0100 1.0304 1.0182 1.0211 1.0219 1.0116 1.0253 1.0096 1.0087 1.0049 0.9972 1.0054 1.0007 1.0021 1.0068 1.0074 1.0095 0.9874
dispcorr: -0.033026775 hartree
energy: -1514.933427246783
dipole: -14.52753 14.41294 -0.11458 -0.07646 -0.50628 -0.58274 -32.91143 31.87342 -1.03801
magnitude: 1.19590 au
magnitude: 3.03974 debye
