program: Orca
programVersion: 5.0.2
elementType: S O O O N N C C C C C C C C C C C C C C C C C C C C H H H H H H H H H H H H H H H H H H H H H H H H H H H H H H H H
charge: 0
multiplicity: 1
keywords: wb97x-d3
keywords: def2-TZVPP
keywords: def2/J RIJCOSX
keywords: DEFGRID2
keywords: scfconv7
keywords: smallprint printgap noloewdin
keywords: NOSOSCF
formula: C20H32N2O3S
InChI: InChI=1/C20H32N2O3S/c1-6-8-13-22(14-9-7-2)26-21(5)19(23)24-17-12-10-11-16-15-20(3,4)25-18(16)17/h10-12H,6-9,13-15H2,1-5H3
58 atoms
S  -0.463348 2.77987 0.006618
O  1.124098 -2.044998 -0.209046
O  0.672068 0.449211 1.164193
O  2.621565 0.488467 0.030849
N  -1.812588 2.029368 -0.573074
N  0.937952 1.92123 -0.507332
C  1.754248 -3.307197 -0.546258
C  1.663609 -4.139729 0.753814
C  1.52325 -3.066979 1.792913
C  1.21226 -1.895018 1.122103
C  3.20302 -3.012033 -0.907146
C  0.998502 -3.911388 -1.711229
C  1.617999 -3.083292 3.170136
C  1.019585 -0.708988 1.809141
C  1.40342 -1.899784 3.869275
C  1.113306 -0.723062 3.192209
C  -2.437371 0.963317 0.196373
C  -2.118147 2.072198 -1.99475
C  -2.18758 -0.460863 -0.288846
C  -2.137268 3.472401 -2.587058
C  -2.697412 -1.477644 0.726557
C  -3.165593 4.397092 -1.949644
C  1.516076 0.915241 0.2156
C  -2.555584 -2.916819 0.255865
C  -3.205033 5.767023 -2.610913
C  1.72513 2.459023 -1.607282
H  2.546219 -4.76642 0.891471
H  0.790799 -4.801326 0.750765
H  3.737027 -2.561157 -0.069788
H  3.259496 -2.32021 -1.747078
H  3.719676 -3.931771 -1.185539
H  1.440676 -4.869446 -1.985884
H  1.039193 -3.262758 -2.586615
H  -0.048838 -4.083058 -1.462226
H  1.853905 -3.997688 3.699053
H  1.474485 -1.887453 4.948046
H  0.961194 0.200615 3.735194
H  -3.518442 1.148805 0.205137
H  -2.097648 1.065657 1.227356
H  -3.11242 1.631163 -2.117423
H  -1.430526 1.434553 -2.564549
H  -2.689853 -0.624826 -1.24833
H  -1.12428 -0.621186 -0.469095
H  -1.144655 3.926613 -2.519418
H  -2.34781 3.370085 -3.656365
H  -3.747866 -1.270882 0.956685
H  -2.14995 -1.349561 1.664856
H  -4.154883 3.932261 -2.008641
H  -2.947397 4.508081 -0.8855
H  -1.510611 -3.156403 0.05804
H  -3.11562 -3.092599 -0.66438
H  -2.92085 -3.620095 1.00452
H  -3.45905 5.692168 -3.669797
H  -2.237691 6.267203 -2.541317
H  -3.944135 6.416456 -2.141751
H  2.112154 1.656537 -2.232047
H  2.568882 3.054257 -1.256635
H  1.082668 3.091913 -2.212152
totalener: -1514.89981972 hartree
nucrepener: 2787.61245325 hartree
electener: -4302.51227297 hartree
oneelecener: -7613.35985475 hartree
twoeener: 3310.84758178 hartree
kineticenergy: 1509.14426825 hartree
xcener: -129.020997022659 hartree
chargesum: 0.0000000
charge: 0.035660 -0.333611 -0.313497 -0.378782 -0.144072 -0.183553 0.313099 -0.159050 -0.063510 0.294121 -0.293540 -0.273286 -0.154735 0.086762 -0.105689 -0.198017 -0.085568 -0.120990 -0.109858 -0.140341 -0.102145 -0.059815 0.437998 -0.226596 -0.262705 -0.174347 0.093183 0.081174 0.113223 0.094272 0.084202 0.090815 0.095489 0.091815 0.117100 0.119855 0.121200 0.084234 0.087413 0.088372 0.107792 0.067663 0.061323 0.064903 0.069464 0.063484 0.066748 0.050532 0.062314 0.028303 0.076911 0.087935 0.070442 0.076334 0.085108 0.108037 0.114560 0.091867
qa: 0.0357 -0.3336 -0.3135 -0.3788 -0.1441 -0.1836 0.3131 -0.1591 -0.0635 0.2941 -0.2935 -0.2733 -0.1547 0.0868 -0.1057 -0.1980 -0.0856 -0.1210 -0.1099 -0.1403 -0.1021 -0.0598 0.4380 -0.2266 -0.2627 -0.1743 0.0932 0.0812 0.1132 0.0943 0.0842 0.0908 0.0955 0.0918 0.1171 0.1199 0.1212 0.0842 0.0874 0.0884 0.1078 0.0677 0.0613 0.0649 0.0695 0.0635 0.0667 0.0505 0.0623 0.0283 0.0769 0.0879 0.0704 0.0763 0.0851 0.1080 0.1146 0.0919
va: 2.3736 2.0649 2.0750 2.1406 3.0081 3.1394 3.8570 3.9851 3.7051 3.8302 3.9664 3.9205 4.0147 3.8758 3.9272 4.0465 3.9042 3.9219 3.7672 3.9136 3.8992 3.8412 4.2814 3.9417 3.9552 3.9260 1.0041 1.0043 1.0051 1.0157 1.0067 1.0061 1.0102 1.0029 1.0054 1.0009 1.0083 0.9988 1.0175 0.9935 0.9914 1.0134 1.0424 1.0209 1.0161 1.0111 1.0079 1.0114 1.0229 1.0206 1.0064 1.0093 1.0023 1.0024 1.0059 0.9994 0.9950 0.9978
dispcorr: -0.034030971 hartree
energy: -1514.933850692076
dipole: -19.83355 19.25567 -0.57787 -2.49265 1.68598 -0.80666 -20.05343 19.49251 -0.56092
magnitude: 1.13986 au
magnitude: 2.89729 debye
