program: Orca
programVersion: 5.0.2
elementType: S O O O N N C C C C C C C C C C C C C C C C C C C C H H H H H H H H H H H H H H H H H H H H H H H H H H H H H H H H
charge: 0
multiplicity: 1
keywords: wb97x-d3
keywords: def2-TZVPP
keywords: def2/J RIJCOSX
keywords: DEFGRID2
keywords: scfconv7
keywords: smallprint printgap noloewdin
keywords: NOSOSCF
formula: C20H32N2O3S
InChI: InChI=1/C20H32N2O3S/c1-6-8-13-22(14-9-7-2)26-21(5)19(23)24-17-12-10-11-16-15-20(3,4)25-18(16)17/h10-12H,6-9,13-15H2,1-5H3
58 atoms
S  -1.72829 0.25255 -1.577567
O  2.235152 -2.235083 -0.30199
O  0.48059 -0.023988 0.167099
O  -0.318011 -1.726814 1.409073
N  -2.301065 1.719359 -1.072467
N  -1.593523 -0.796316 -0.224159
C  3.196865 -3.290181 -0.045696
C  4.415186 -2.567616 0.577226
C  3.79581 -1.297432 1.078162
C  2.540577 -1.205513 0.499048
C  3.506359 -3.965831 -1.365408
C  2.563542 -4.251006 0.950259
C  4.257762 -0.299825 1.913233
C  1.711601 -0.130523 0.762928
C  3.436897 0.794392 2.167625
C  2.17175 0.87294 1.600433
C  -3.706254 1.860139 -0.734767
C  -1.38828 2.683379 -0.468854
C  -4.059167 1.616587 0.728972
C  -0.186758 3.012662 -1.340568
C  -5.558191 1.722477 0.978945
C  -0.552443 3.602182 -2.696363
C  -0.456899 -0.926947 0.525985
C  -5.935279 1.465212 2.430416
C  0.674689 3.968768 -3.519096
C  -2.674448 -1.718571 0.091797
H  5.187989 -2.359552 -0.169885
H  4.876973 -3.166801 1.363781
H  3.917136 -3.257059 -2.084851
H  2.611777 -4.413365 -1.799209
H  4.238507 -4.760371 -1.217917
H  2.319829 -3.745979 1.885986
H  3.245258 -5.072886 1.173737
H  1.641257 -4.672195 0.550474
H  5.239949 -0.364176 2.363629
H  3.776827 1.586471 2.82043
H  1.528796 1.718659 1.808606
H  -4.269627 1.173803 -1.371074
H  -4.019911 2.871878 -1.017084
H  -1.051373 2.353312 0.520607
H  -1.966753 3.598601 -0.306215
H  -3.706002 0.628432 1.034179
H  -3.532886 2.336193 1.364408
H  0.431126 3.726461 -0.786106
H  0.430552 2.122008 -1.474393
H  -6.084922 1.012396 0.333795
H  -5.909153 2.715156 0.680333
H  -1.166874 2.890749 -3.252299
H  -1.175476 4.490723 -2.551675
H  -5.63511 0.464889 2.746058
H  -7.010787 1.550255 2.585752
H  -5.44892 2.177787 3.098218
H  1.300716 3.094436 -3.703097
H  1.291127 4.709942 -3.007327
H  0.39784 4.384546 -4.488097
H  -3.022086 -1.594018 1.11786
H  -2.362619 -2.755661 -0.034734
H  -3.501262 -1.519195 -0.584282
totalener: -1514.90152485 hartree
nucrepener: 2703.87730114 hartree
electener: -4218.77882599 hartree
oneelecener: -7445.94211597 hartree
twoeener: 3227.16328998 hartree
kineticenergy: 1509.14025849 hartree
xcener: -129.018189226980 hartree
chargesum: -0.0000000
charge: 0.041441 -0.326529 -0.318043 -0.381887 -0.135364 -0.186037 0.332373 -0.143353 -0.065656 0.246598 -0.270414 -0.296725 -0.176745 0.127692 -0.111630 -0.161713 -0.111364 -0.125481 -0.102265 -0.137413 -0.083875 -0.060594 0.438442 -0.248189 -0.262266 -0.187414 0.079686 0.087748 0.088172 0.094144 0.084821 0.113832 0.082802 0.092289 0.116575 0.118707 0.105936 0.088760 0.078620 0.100164 0.093563 0.061614 0.070027 0.065024 0.078850 0.054675 0.055374 0.058895 0.047622 0.074536 0.085818 0.073542 0.078681 0.070328 0.082658 0.104000 0.120926 0.098020
qa: 0.0414 -0.3265 -0.3180 -0.3819 -0.1354 -0.1860 0.3324 -0.1434 -0.0657 0.2466 -0.2704 -0.2967 -0.1767 0.1277 -0.1116 -0.1617 -0.1114 -0.1255 -0.1023 -0.1374 -0.0839 -0.0606 0.4384 -0.2482 -0.2623 -0.1874 0.0797 0.0877 0.0882 0.0941 0.0848 0.1138 0.0828 0.0923 0.1166 0.1187 0.1059 0.0888 0.0786 0.1002 0.0936 0.0616 0.0700 0.0650 0.0788 0.0547 0.0554 0.0589 0.0476 0.0745 0.0858 0.0735 0.0787 0.0703 0.0827 0.1040 0.1209 0.0980
va: 2.3718 2.1367 2.0837 2.1381 2.9872 3.1452 3.8045 3.9811 3.6794 3.9919 3.9356 3.9716 4.0230 3.8871 3.9334 4.0396 3.9481 3.9242 3.8003 3.8995 3.8980 3.8590 4.2945 3.9499 3.9554 3.9071 1.0065 1.0027 1.0107 1.0103 1.0050 1.0042 1.0067 1.0148 1.0072 1.0024 1.0089 1.0153 1.0028 1.0015 0.9917 1.0116 1.0139 1.0142 1.0226 1.0081 1.0100 1.0228 1.0103 1.0041 1.0061 1.0039 1.0031 1.0023 1.0057 0.9904 1.0036 1.0086
dispcorr: -0.030346111 hartree
energy: -1514.931870955760
dipole: -16.59915 16.58108 -0.01807 11.70803 -11.53537 0.17266 -2.10651 2.13517 0.02866
magnitude: 0.17595 au
magnitude: 0.44724 debye
