program: Orca
programVersion: 5.0.2
elementType: S O O O N N C C C C C C C C C C C C C C C C C C C C H H H H H H H H H H H H H H H H H H H H H H H H H H H H H H H H
charge: 0
multiplicity: 1
keywords: wb97x-d3
keywords: def2-TZVPP
keywords: def2/J RIJCOSX
keywords: DEFGRID2
keywords: scfconv7
keywords: smallprint printgap noloewdin
keywords: NOSOSCF
formula: C20H32N2O3S
InChI: InChI=1/C20H32N2O3S/c1-6-8-13-22(14-9-7-2)26-21(5)19(23)24-17-12-10-11-16-15-20(3,4)25-18(16)17/h10-12H,6-9,13-15H2,1-5H3
58 atoms
S  -2.137525 1.396022 1.236744
O  1.550463 -0.66651 -0.428468
O  0.27359 0.108743 1.973632
O  1.655931 1.857608 1.659342
N  -2.24504 0.772741 -0.283404
N  -0.589816 2.113372 1.423188
C  2.534517 -1.092338 -1.404457
C  3.336652 -2.221426 -0.70704
C  2.965251 -2.036393 0.733541
C  1.923266 -1.127983 0.774491
C  3.415154 0.109007 -1.707689
C  1.78185 -1.570373 -2.630359
C  3.435241 -2.607785 1.900618
C  1.335805 -0.757563 1.970202
C  2.844476 -2.248505 3.107574
C  1.806034 -1.325628 3.141564
C  -1.914588 -0.621793 -0.537147
C  -2.68704 1.578253 -1.409403
C  -3.087348 -1.434232 -1.074904
C  -1.712066 1.633327 -2.581071
C  -4.298732 -1.442438 -0.152741
C  -0.354942 2.234024 -2.247135
C  0.547744 1.399019 1.675903
C  -5.423008 -2.329544 -0.667576
C  0.546463 2.35322 -3.467395
C  -0.409142 3.535585 1.175825
H  4.407874 -2.120823 -0.891844
H  3.039072 -3.210651 -1.068551
H  2.823751 0.934623 -2.104199
H  4.174004 -0.149933 -2.447446
H  3.922673 0.460947 -0.808389
H  2.481781 -1.903823 -3.397251
H  1.175518 -0.770562 -3.058051
H  1.124152 -2.405487 -2.387127
H  4.246777 -3.323812 1.879952
H  3.199255 -2.681046 4.032724
H  1.353918 -1.04189 4.082693
H  -1.578842 -1.056055 0.403299
H  -1.066097 -0.695206 -1.224744
H  -2.871895 2.588171 -1.040505
H  -3.651467 1.204132 -1.77524
H  -3.380831 -1.080998 -2.069555
H  -2.732031 -2.459007 -1.223501
H  -1.579049 0.633384 -3.007604
H  -2.188739 2.224072 -3.370252
H  -4.668922 -0.422205 -0.021571
H  -3.990898 -1.777465 0.842319
H  -0.501285 3.227185 -1.812657
H  0.140746 1.634888 -1.479286
H  -5.772933 -1.999613 -1.647418
H  -6.280115 -2.319754 0.005911
H  -5.097396 -3.366107 -0.769609
H  0.734457 1.378918 -3.922938
H  1.513358 2.785421 -3.208037
H  0.099096 2.987903 -4.234224
H  0.093263 4.015168 2.015163
H  -1.390409 3.986178 1.056481
H  0.17813 3.723257 0.277302
totalener: -1514.89958177 hartree
nucrepener: 2827.05428714 hartree
electener: -4341.95386891 hartree
oneelecener: -7692.07196160 hartree
twoeener: 3350.11809269 hartree
kineticenergy: 1509.14670291 hartree
xcener: -129.025152104214 hartree
chargesum: -0.0000000
charge: 0.045610 -0.326428 -0.318328 -0.374788 -0.143465 -0.153885 0.318631 -0.150976 -0.091760 0.321213 -0.290849 -0.298292 -0.155669 0.084390 -0.112364 -0.167026 -0.090837 -0.125948 -0.119631 -0.095702 -0.083123 -0.067721 0.407347 -0.258890 -0.306802 -0.183365 0.088627 0.081181 0.090943 0.087004 0.117337 0.104345 0.079347 0.095398 0.116655 0.118328 0.118061 0.101978 0.069907 0.090985 0.088178 0.059477 0.072605 0.060296 0.074973 0.054755 0.063335 0.058098 0.037583 0.071258 0.086288 0.072086 0.078709 0.095141 0.091655 0.118292 0.093625 0.102209
qa: 0.0456 -0.3264 -0.3183 -0.3748 -0.1435 -0.1539 0.3186 -0.1510 -0.0918 0.3212 -0.2908 -0.2983 -0.1557 0.0844 -0.1124 -0.1670 -0.0908 -0.1259 -0.1196 -0.0957 -0.0831 -0.0677 0.4073 -0.2589 -0.3068 -0.1834 0.0886 0.0812 0.0909 0.0870 0.1173 0.1043 0.0793 0.0954 0.1167 0.1183 0.1181 0.1020 0.0699 0.0910 0.0882 0.0595 0.0726 0.0603 0.0750 0.0548 0.0633 0.0581 0.0376 0.0713 0.0863 0.0721 0.0787 0.0951 0.0917 0.1183 0.0936 0.1022
va: 2.3857 2.0984 2.0823 2.1382 3.0036 3.1504 3.8024 4.0055 3.7340 3.8999 3.9826 3.9407 4.0104 3.8718 3.9406 4.0676 3.9589 3.9476 3.8724 3.7918 3.8710 3.8377 4.3192 3.9574 3.9650 3.9112 1.0028 1.0039 1.0097 1.0070 1.0031 1.0094 1.0136 1.0075 1.0053 1.0012 1.0070 1.0129 1.0022 1.0158 0.9936 1.0047 1.0157 1.0043 1.0167 1.0140 1.0112 1.0128 1.0208 1.0026 1.0056 1.0031 0.9972 1.0004 1.0076 1.0023 1.0119 0.9896
dispcorr: -0.035689101 hartree
energy: -1514.935270869196
dipole: -12.33779 12.31972 -0.01806 -1.67006 1.13590 -0.53416 -32.32242 31.07832 -1.24410
magnitude: 1.35405 au
magnitude: 3.44172 debye
