program: Orca
programVersion: 5.0.2
elementType: S O O O N N C C C C C C C C C C C C C C C C C C C C H H H H H H H H H H H H H H H H H H H H H H H H H H H H H H H H
charge: 0
multiplicity: 1
keywords: wb97x-d3
keywords: def2-TZVPP
keywords: def2/J RIJCOSX
keywords: DEFGRID2
keywords: scfconv7
keywords: smallprint printgap noloewdin
keywords: NOSOSCF
formula: C20H32N2O3S
InChI: InChI=1/C20H32N2O3S/c1-6-8-13-22(14-9-7-2)26-21(5)19(23)24-17-12-10-11-16-15-20(3,4)25-18(16)17/h10-12H,6-9,13-15H2,1-5H3
58 atoms
S  -2.022664 2.071637 0.895226
O  1.227233 -0.941847 -0.497107
O  -0.102328 0.158833 1.761616
O  1.737142 1.431449 1.493902
N  -2.3380 1.360585 -0.563896
N  -0.324333 2.289114 1.076882
C  2.226827 -1.591355 -1.322467
C  2.523911 -2.929922 -0.602531
C  2.024913 -2.656859 0.785024
C  1.286285 -1.488973 0.727524
C  3.450981 -0.688933 -1.339558
C  1.634219 -1.770358 -2.70534
C  2.141479 -3.348415 1.975347
C  0.665899 -0.972345 1.849949
C  1.50835 -2.844379 3.106856
C  0.780369 -1.662188 3.044894
C  -2.297093 -0.094335 -0.697013
C  -2.087478 2.104443 -1.787262
C  -3.105927 -0.823632 0.363582
C  -0.712639 1.867944 -2.411881
C  -3.23704 -2.318998 0.080784
C  -0.487685 2.669821 -3.690775
C  0.545244 1.303656 1.444946
C  -1.923278 -3.089723 0.123355
C  -0.397463 4.174822 -3.47239
C  0.271013 3.573614 0.742679
H  3.586279 -3.1772 -0.641494
H  1.979764 -3.763467 -1.058256
H  3.201052 0.294139 -1.738672
H  4.236016 -1.120328 -1.962344
H  3.851272 -0.54844 -0.334635
H  0.727547 -2.375679 -2.670667
H  2.348678 -2.270427 -3.359908
H  1.386619 -0.808252 -3.156044
H  2.710832 -4.267304 2.02998
H  1.589378 -3.368125 4.04924
H  0.297082 -1.266334 3.928485
H  -1.269318 -0.463187 -0.724885
H  -2.731924 -0.318818 -1.677868
H  -2.235818 3.162169 -1.563505
H  -2.858505 1.827647 -2.51691
H  -2.65463 -0.675888 1.346263
H  -4.102361 -0.375646 0.408264
H  0.07215 2.103752 -1.688412
H  -0.599727 0.803813 -2.635368
H  -3.717635 -2.466216 -0.891831
H  -3.921232 -2.747894 0.817062
H  0.436673 2.32424 -4.160175
H  -1.285188 2.448753 -4.407287
H  -1.227434 -2.764389 -0.651187
H  -2.092458 -4.157121 -0.022338
H  -1.418939 -2.964812 1.082794
H  -0.158007 4.694186 -4.400369
H  0.382642 4.420007 -2.74919
H  -1.3322 4.596482 -3.101654
H  0.902896 3.51307 -0.145125
H  0.879372 3.948887 1.564563
H  -0.530903 4.28102 0.552234
totalener: -1514.89909243 hartree
nucrepener: 2866.08951719 hartree
electener: -4380.98860962 hartree
oneelecener: -7770.15592406 hartree
twoeener: 3389.16731444 hartree
kineticenergy: 1509.14071071 hartree
xcener: -129.022100726070 hartree
chargesum: 0.0000000
charge: 0.033520 -0.323968 -0.314697 -0.376126 -0.121350 -0.180721 0.319007 -0.160349 -0.079313 0.314692 -0.293209 -0.295154 -0.137249 0.065821 -0.112491 -0.174138 -0.098977 -0.106764 -0.114979 -0.106485 -0.104083 -0.095356 0.420697 -0.241956 -0.255126 -0.170118 0.092013 0.080365 0.091314 0.085525 0.116909 0.093667 0.103473 0.088762 0.116540 0.119385 0.118985 0.050576 0.087649 0.088593 0.082128 0.080888 0.079316 0.071271 0.063687 0.048277 0.068179 0.066083 0.052959 0.047992 0.091509 0.079234 0.090529 0.072830 0.074355 0.091722 0.119000 0.095159
qa: 0.0335 -0.3240 -0.3147 -0.3761 -0.1213 -0.1807 0.3190 -0.1603 -0.0793 0.3147 -0.2932 -0.2952 -0.1372 0.0658 -0.1125 -0.1741 -0.0990 -0.1068 -0.1150 -0.1065 -0.1041 -0.0954 0.4207 -0.2420 -0.2551 -0.1701 0.0920 0.0804 0.0913 0.0855 0.1169 0.0937 0.1035 0.0888 0.1165 0.1194 0.1190 0.0506 0.0876 0.0886 0.0821 0.0809 0.0793 0.0713 0.0637 0.0483 0.0682 0.0661 0.0530 0.0480 0.0915 0.0792 0.0905 0.0728 0.0744 0.0917 0.1190 0.0952
va: 2.3552 2.0695 2.0692 2.1414 3.0433 3.1367 3.8205 4.0123 3.7177 3.8165 3.9748 3.9341 4.0091 3.8270 3.9345 4.0534 3.9387 3.9422 3.8830 3.8276 3.9140 3.9009 4.3141 3.9441 3.9350 3.9061 1.0028 1.0059 1.0123 1.0069 1.0030 1.0022 1.0089 1.0076 1.0046 1.0010 1.0078 0.9978 0.9955 1.0188 1.0018 1.0225 1.0195 1.0148 1.0198 1.0096 1.0083 1.0065 1.0097 1.0067 1.0074 1.0043 1.0079 1.0047 1.0028 0.9921 1.0036 1.0121
dispcorr: -0.037031420 hartree
energy: -1514.936123852266
dipole: -3.07341 3.21404 0.14063 -1.36236 0.74779 -0.61458 -28.88057 27.67741 -1.20316
magnitude: 1.35833 au
magnitude: 3.45261 debye
