program: Orca
programVersion: 5.0.2
elementType: S O O O N N C C C C C C C C C C C C C C C C C C C C H H H H H H H H H H H H H H H H H H H H H H H H H H H H H H H H
charge: 0
multiplicity: 1
keywords: wb97x-d3
keywords: def2-TZVPP
keywords: def2/J RIJCOSX
keywords: DEFGRID2
keywords: scfconv7
keywords: smallprint printgap noloewdin
keywords: NOSOSCF
formula: C20H32N2O3S
InChI: InChI=1/C20H32N2O3S/c1-6-8-13-22(14-9-7-2)26-21(5)19(23)24-17-12-10-11-16-15-20(3,4)25-18(16)17/h10-12H,6-9,13-15H2,1-5H3
58 atoms
S  -1.902459 1.502432 0.537538
O  1.619331 -1.735033 -0.022431
O  0.776807 0.759147 1.08471
O  0.346931 -0.766141 2.685314
N  -2.279019 0.624984 -0.82501
N  -1.350402 0.398445 1.72708
C  2.34387 -2.982431 -0.17557
C  3.835552 -2.570053 -0.202869
C  3.795491 -1.218822 0.445758
C  2.46693 -0.832708 0.495778
C  1.876662 -3.632123 -1.46159
C  2.030622 -3.837159 1.04309
C  4.784231 -0.381374 0.923544
C  2.093774 0.377082 1.051076
C  4.418603 0.848997 1.460327
C  3.082325 1.22126 1.528706
C  -3.452951 -0.235077 -0.771363
C  -1.174845 0.131078 -1.644866
C  -4.732447 0.496697 -0.390692
C  -0.239537 1.227233 -2.128289
C  -5.033152 1.727479 -1.239837
C  -0.928154 2.318759 -2.936717
C  -0.03806 0.049955 1.895061
C  -5.075719 1.453246 -2.736437
C  0.050792 3.372854 -3.434587
C  -2.304368 -0.259192 2.60853
H  4.21839 -2.504971 -1.226441
H  4.459078 -3.289339 0.330887
H  0.810487 -3.858264 -1.425629
H  2.410152 -4.568926 -1.625168
H  2.060807 -2.98467 -2.319385
H  2.344523 -3.341876 1.962939
H  2.544587 -4.797365 0.979622
H  0.960169 -4.028243 1.117834
H  5.825661 -0.673567 0.883209
H  5.176535 1.519407 1.840995
H  2.797634 2.171566 1.961013
H  -3.298757 -1.089932 -0.098251
H  -3.575923 -0.662546 -1.769624
H  -1.628659 -0.349581 -2.516974
H  -0.602742 -0.647399 -1.126755
H  -5.551683 -0.223563 -0.482247
H  -4.70461 0.786891 0.661904
H  0.286052 1.671983 -1.281937
H  0.530914 0.746125 -2.738954
H  -4.293397 2.50438 -1.034912
H  -5.994003 2.13745 -0.91831
H  -1.45281 1.870826 -3.787387
H  -1.69858 2.795486 -2.32684
H  -5.765628 0.641531 -2.976818
H  -4.093023 1.183753 -3.125429
H  -5.405264 2.335127 -3.28609
H  0.815832 2.935719 -4.078517
H  0.563417 3.856458 -2.601427
H  -0.45434 4.151478 -4.0065
H  -3.271004 0.221175 2.484035
H  -2.002648 -0.167924 3.651335
H  -2.406348 -1.320269 2.375354
totalener: -1514.90121577 hartree
nucrepener: 2780.28948358 hartree
electener: -4295.19069935 hartree
oneelecener: -7598.74596730 hartree
twoeener: 3303.55526795 hartree
kineticenergy: 1509.15030820 hartree
xcener: -129.021430903728 hartree
chargesum: -0.0000000
charge: 0.038497 -0.337886 -0.316065 -0.379647 -0.119870 -0.173392 0.320452 -0.150496 -0.067694 0.313056 -0.282448 -0.294110 -0.162805 0.092681 -0.107744 -0.181617 -0.155408 -0.144208 -0.135437 -0.117828 -0.084969 -0.057917 0.422825 -0.259860 -0.266633 -0.185218 0.079879 0.088888 0.093296 0.092130 0.088970 0.116454 0.083065 0.091157 0.116818 0.119083 0.119475 0.104489 0.092663 0.086527 0.107137 0.075036 0.076803 0.077374 0.066075 0.057780 0.069886 0.048670 0.051886 0.079743 0.066936 0.089319 0.071499 0.077970 0.082827 0.098954 0.117132 0.105820
qa: 0.0385 -0.3379 -0.3161 -0.3796 -0.1199 -0.1734 0.3205 -0.1505 -0.0677 0.3131 -0.2824 -0.2941 -0.1628 0.0927 -0.1077 -0.1816 -0.1554 -0.1442 -0.1354 -0.1178 -0.0850 -0.0579 0.4228 -0.2599 -0.2666 -0.1852 0.0799 0.0889 0.0933 0.0921 0.0890 0.1165 0.0831 0.0912 0.1168 0.1191 0.1195 0.1045 0.0927 0.0865 0.1071 0.0750 0.0768 0.0774 0.0661 0.0578 0.0699 0.0487 0.0519 0.0797 0.0669 0.0893 0.0715 0.0780 0.0828 0.0990 0.1171 0.1058
va: 2.3757 2.0956 2.0721 2.1357 2.9465 3.1741 3.8338 3.9946 3.7079 3.8747 3.9249 3.9716 4.0174 3.8448 3.9320 4.0806 3.9312 3.9249 3.8740 3.8428 3.8722 3.8613 4.3061 3.9307 3.9706 3.9081 1.0048 1.0031 1.0094 1.0065 1.0100 1.0036 1.0066 1.0145 1.0056 1.0012 1.0067 0.9973 0.9953 1.0005 1.0200 1.0148 1.0226 1.0222 1.0162 1.0201 1.0119 1.0081 1.0182 1.0044 1.0029 1.0077 1.0026 1.0031 1.0052 1.0014 1.0046 0.9921
dispcorr: -0.032967936 hartree
energy: -1514.934183703898
dipole: -19.46756 19.44294 -0.02462 -2.77230 1.93344 -0.83886 -24.42594 23.70139 -0.72455
magnitude: 1.10873 au
magnitude: 2.81816 debye
