program: Orca
programVersion: 5.0.2
elementType: S O O O N N C C C C C C C C C C C C C C C C C C C C H H H H H H H H H H H H H H H H H H H H H H H H H H H H H H H H
charge: 0
multiplicity: 1
keywords: wb97x-d3
keywords: def2-TZVPP
keywords: def2/J RIJCOSX
keywords: DEFGRID2
keywords: scfconv7
keywords: smallprint printgap noloewdin
keywords: NOSOSCF
formula: C20H32N2O3S
InChI: InChI=1/C20H32N2O3S/c1-6-8-13-22(14-9-7-2)26-21(5)19(23)24-17-12-10-11-16-15-20(3,4)25-18(16)17/h10-12H,6-9,13-15H2,1-5H3
58 atoms
S  -1.583029 2.255826 0.558611
O  0.917029 -1.576949 -0.18971
O  0.825328 0.914464 1.173633
O  -0.016323 -0.578912 2.63501
N  -1.847948 1.562376 -0.910562
N  -1.355185 1.015741 1.726778
C  1.248778 -2.954729 -0.494925
C  2.797087 -2.987799 -0.530893
C  3.152475 -1.756589 0.248637
C  1.991965 -1.015581 0.384634
C  0.606848 -3.296527 -1.823448
C  0.706277 -3.813983 0.637665
C  4.343141 -1.285509 0.767136
C  1.98234 0.187339 1.065696
C  4.347606 -0.062478 1.430691
C  3.173922 0.664993 1.58463
C  -3.188823 1.181358 -1.320908
C  -0.745742 1.280296 -1.822449
C  -3.722267 -0.108373 -0.708114
C  -0.659903 2.269369 -2.980886
C  -2.832559 -1.326852 -0.909292
C  -0.415546 3.715843 -2.563611
C  -0.169436 0.360623 1.9052
C  -3.429756 -2.589411 -0.304752
C  0.913237 3.940104 -1.853712
C  -2.465155 0.559086 2.547561
H  3.178932 -2.93069 -1.555183
H  3.1870 -3.907075 -0.090557
H  0.845286 -4.322562 -2.105073
H  0.963781 -2.636942 -2.614947
H  -0.479214 -3.209601 -1.769787
H  -0.373679 -3.695744 0.731623
H  1.154805 -3.538071 1.593042
H  0.919206 -4.867859 0.452871
H  5.258205 -1.853837 0.661065
H  5.268634 0.324185 1.844401
H  3.17592 1.608037 2.115262
H  -3.179356 1.085813 -2.410562
H  -3.879991 1.997563 -1.094833
H  -0.849024 0.263906 -2.213658
H  0.182138 1.283955 -1.25603
H  -3.897821 0.043449 0.359688
H  -4.70946 -0.297754 -1.143497
H  0.147439 1.938916 -3.643044
H  -1.575365 2.215408 -3.578631
H  -1.8502 -1.1445 -0.467615
H  -2.662165 -1.481284 -1.980218
H  -0.457267 4.344837 -3.456682
H  -1.235534 4.055004 -1.924549
H  -3.580029 -2.479793 0.77083
H  -2.777944 -3.451399 -0.454046
H  -4.397473 -2.829093 -0.748417
H  1.068973 4.998143 -1.642076
H  1.751652 3.602371 -2.466024
H  0.962223 3.410741 -0.901888
H  -2.194736 0.561325 3.602713
H  -2.78229 -0.450769 2.282634
H  -3.299252 1.239887 2.402949
totalener: -1514.89908125 hartree
nucrepener: 2853.87297727 hartree
electener: -4368.77205852 hartree
oneelecener: -7745.82952491 hartree
twoeener: 3377.05746639 hartree
kineticenergy: 1509.14477456 hartree
xcener: -129.025635292712 hartree
chargesum: -0.0000000
charge: 0.036115 -0.327428 -0.324309 -0.375925 -0.146258 -0.154813 0.316943 -0.141272 -0.079466 0.294459 -0.285173 -0.293714 -0.164334 0.125355 -0.099881 -0.198657 -0.114779 -0.089910 -0.121363 -0.123081 -0.095770 -0.116172 0.415903 -0.253225 -0.239946 -0.190978 0.079306 0.088630 0.098432 0.090277 0.085621 0.089437 0.117190 0.086549 0.116343 0.118384 0.119223 0.083598 0.103311 0.092889 0.089128 0.068006 0.076676 0.069224 0.062435 0.038999 0.067201 0.069465 0.059663 0.080707 0.067587 0.084623 0.083112 0.073102 0.073538 0.120579 0.098133 0.096314
qa: 0.0361 -0.3274 -0.3243 -0.3759 -0.1463 -0.1548 0.3169 -0.1413 -0.0795 0.2945 -0.2852 -0.2937 -0.1643 0.1254 -0.0999 -0.1987 -0.1148 -0.0899 -0.1214 -0.1231 -0.0958 -0.1162 0.4159 -0.2532 -0.2399 -0.1910 0.0793 0.0886 0.0984 0.0903 0.0856 0.0894 0.1172 0.0865 0.1163 0.1184 0.1192 0.0836 0.1033 0.0929 0.0891 0.0680 0.0767 0.0692 0.0624 0.0390 0.0672 0.0695 0.0597 0.0807 0.0676 0.0846 0.0831 0.0731 0.0735 0.1206 0.0981 0.0963
va: 2.3843 2.1022 2.0588 2.1387 2.9705 3.1425 3.8180 3.9864 3.7276 3.9231 3.9324 3.9827 4.0177 3.8225 3.9196 4.0769 3.9580 3.9301 3.8398 3.8979 3.8396 3.8904 4.3126 3.9496 3.9282 3.9221 1.0050 1.0034 1.0081 1.0098 1.0089 1.0119 1.0042 1.0066 1.0060 1.0012 1.0072 1.0008 1.0111 1.0043 1.0102 1.0113 1.0203 1.0157 1.0163 1.0181 1.0025 1.0116 1.0159 1.0021 1.0100 1.0054 1.0079 1.0039 1.0132 1.0051 0.9857 1.0090
dispcorr: -0.036179046 hartree
energy: -1514.935260292920
dipole: -15.65467 15.48041 -0.17426 -9.07943 8.40331 -0.67612 -20.12318 19.05871 -1.06447
magnitude: 1.27303 au
magnitude: 3.23578 debye
