program: Orca
programVersion: 5.0.2
elementType: S O O O N N C C C C C C C C C C C C C C C C C C C C H H H H H H H H H H H H H H H H H H H H H H H H H H H H H H H H
charge: 0
multiplicity: 1
keywords: wb97x-d3
keywords: def2-TZVPP
keywords: def2/J RIJCOSX
keywords: DEFGRID2
keywords: scfconv7
keywords: smallprint printgap noloewdin
keywords: NOSOSCF
formula: C20H32N2O3S
InChI: InChI=1/C20H32N2O3S/c1-6-8-13-22(14-9-7-2)26-21(5)19(23)24-17-12-10-11-16-15-20(3,4)25-18(16)17/h10-12H,6-9,13-15H2,1-5H3
58 atoms
S  -1.885535 2.268402 0.820779
O  0.838194 -1.45369 -0.115721
O  0.649573 1.077925 1.192268
O  0.050834 -0.490267 2.696725
N  -2.146907 1.677533 -0.702533
N  -1.484684 0.975051 1.88365
C  1.288036 -2.780416 -0.491875
C  2.814855 -2.636748 -0.710878
C  3.118536 -1.357171 0.009185
C  1.906544 -0.756653 0.301129
C  0.538772 -3.180888 -1.7465
C  0.983208 -3.70708 0.674448
C  4.305463 -0.734838 0.345087
C  1.848562 0.461764 0.954783
C  4.256316 0.498802 0.985682
C  3.036602 1.088734 1.292359
C  -3.342408 0.893603 -0.966581
C  -1.014084 1.383733 -1.576519
C  -3.168253 -0.616071 -0.826136
C  -0.030814 2.530532 -1.726934
C  -4.451283 -1.380786 -1.122215
C  1.161685 2.126146 -2.585228
C  -0.234869 0.43381 1.987834
C  -4.256799 -2.888394 -1.051631
C  2.171858 3.251197 -2.750289
C  -2.516053 0.369203 2.711463
H  3.066925 -2.561248 -1.773416
H  3.356949 -3.496052 -0.312004
H  -0.536841 -3.222342 -1.568188
H  0.859401 -4.16902 -2.077702
H  0.72517 -2.476662 -2.558058
H  1.505506 -3.388513 1.577482
H  1.294046 -4.72669 0.442369
H  -0.084539 -3.718254 0.89314
H  5.257593 -1.19368 0.111733
H  5.172892 1.003172 1.258602
H  2.999137 2.043531 1.80019
H  -3.674852 1.12028 -1.986747
H  -4.130034 1.246162 -0.297174
H  -1.438865 1.158862 -2.560844
H  -0.488323 0.477721 -1.260424
H  -2.382246 -0.960946 -1.504972
H  -2.818607 -0.858165 0.18087
H  -0.542297 3.390382 -2.169866
H  0.325423 2.851763 -0.746904
H  -4.820769 -1.106134 -2.115097
H  -5.231068 -1.07709 -0.41724
H  1.655274 1.262095 -2.129821
H  0.815913 1.796223 -3.570343
H  -3.907886 -3.195732 -0.064449
H  -3.514926 -3.223484 -1.778787
H  -5.183264 -3.424872 -1.256567
H  2.568302 3.564867 -1.783503
H  1.720179 4.126228 -3.220615
H  3.016242 2.943369 -3.367151
H  -2.699897 -0.670456 2.436361
H  -3.434362 0.933978 2.579246
H  -2.24039 0.395357 3.765112
totalener: -1514.90182348 hartree
nucrepener: 2837.60506040 hartree
electener: -4352.50688388 hartree
oneelecener: -7713.17057657 hartree
twoeener: 3360.66369269 hartree
kineticenergy: 1509.14599527 hartree
xcener: -129.019892407851 hartree
chargesum: 0.0000000
charge: 0.035957 -0.330041 -0.311375 -0.374036 -0.116489 -0.186833 0.324901 -0.163569 -0.083595 0.330267 -0.283362 -0.292773 -0.146220 0.071332 -0.108989 -0.186140 -0.115399 -0.104417 -0.083824 -0.127809 -0.083450 -0.078278 0.426316 -0.253793 -0.266454 -0.173876 0.081020 0.089865 0.082489 0.098164 0.090810 0.115486 0.084240 0.091875 0.117523 0.119868 0.119903 0.080135 0.087505 0.091121 0.061645 0.054013 0.062016 0.075304 0.076449 0.054120 0.057067 0.053865 0.057922 0.076879 0.066866 0.090875 0.077445 0.073755 0.082419 0.097968 0.095370 0.117966
qa: 0.0360 -0.3300 -0.3114 -0.3740 -0.1165 -0.1868 0.3249 -0.1636 -0.0836 0.3303 -0.2834 -0.2928 -0.1462 0.0713 -0.1090 -0.1861 -0.1154 -0.1044 -0.0838 -0.1278 -0.0834 -0.0783 0.4263 -0.2538 -0.2665 -0.1739 0.0810 0.0899 0.0825 0.0982 0.0908 0.1155 0.0842 0.0919 0.1175 0.1199 0.1199 0.0801 0.0875 0.0911 0.0616 0.0540 0.0620 0.0753 0.0764 0.0541 0.0571 0.0539 0.0579 0.0769 0.0669 0.0909 0.0774 0.0738 0.0824 0.0980 0.0954 0.1180
va: 2.3560 2.0801 2.0640 2.1459 3.0311 3.1382 3.8221 4.0248 3.7342 3.8217 3.9302 3.9752 4.0127 3.8216 3.9292 4.0497 3.9656 3.9319 3.7857 3.8818 3.8936 3.8738 4.3093 3.9465 3.9631 3.9071 1.0046 1.0021 1.0107 1.0088 1.0083 1.0034 1.0066 1.0136 1.0045 1.0006 1.0078 1.0019 1.0168 0.9953 1.0040 1.0167 1.0137 1.0176 1.0263 1.0103 1.0083 1.0074 1.0067 1.0026 1.0041 1.0079 1.0040 1.0029 1.0059 0.9895 1.0118 1.0021
dispcorr: -0.034652792 hartree
energy: -1514.936476272314
dipole: -12.05968 11.94465 -0.11503 -14.01792 13.15276 -0.86516 -22.29927 21.26480 -1.03447
magnitude: 1.35346 au
magnitude: 3.44023 debye
