program: Orca
programVersion: 5.0.2
elementType: S O O O N N C C C C C C C C C C C C C C C C C C C C H H H H H H H H H H H H H H H H H H H H H H H H H H H H H H H H
charge: 0
multiplicity: 1
keywords: wb97x-d3
keywords: def2-TZVPP
keywords: def2/J RIJCOSX
keywords: DEFGRID2
keywords: scfconv7
keywords: smallprint printgap noloewdin
keywords: NOSOSCF
formula: C20H32N2O3S
InChI: InChI=1/C20H32N2O3S/c1-6-8-13-22(14-9-7-2)26-21(5)19(23)24-17-12-10-11-16-15-20(3,4)25-18(16)17/h10-12H,6-9,13-15H2,1-5H3
58 atoms
S  -1.914115 2.02265 0.768321
O  1.257144 -1.365133 -0.278358
O  0.654935 0.966352 1.243294
O  0.055033 -0.746605 2.578979
N  -2.233795 1.459213 -0.755358
N  -1.509051 0.700056 1.787119
C  1.874283 -2.601642 -0.718366
C  3.394415 -2.305267 -0.720741
C  3.480992 -1.108411 0.179206
C  2.190334 -0.642482 0.359495
C  1.318852 -2.923762 -2.09018
C  1.526009 -3.672234 0.305192
C  4.547315 -0.445756 0.755643
C  1.930012 0.479476 1.124401
C  4.296115 0.689494 1.51936
C  2.996782 1.145374 1.704776
C  -3.503653 0.802443 -1.019957
C  -1.129913 1.077106 -1.63049
C  -3.488897 -0.720168 -0.910317
C  -0.104123 2.176991 -1.841059
C  -4.855292 -1.351331 -1.164878
C  1.039428 1.710028 -2.733895
C  -0.237785 0.213329 1.922202
C  -5.895083 -1.028356 -0.098756
C  2.110706 2.774563 -2.916704
C  -2.53845 0.02335 2.560996
H  3.759154 -2.068424 -1.725424
H  3.968391 -3.161528 -0.362135
H  0.238113 -3.065675 -2.053356
H  1.763459 -3.843197 -2.472038
H  1.534068 -2.123795 -2.799482
H  1.953544 -4.632679 0.013839
H  0.446024 -3.792024 0.390383
H  1.911842 -3.413823 1.292336
H  5.561196 -0.797651 0.614964
H  5.115672 1.221871 1.981834
H  2.803834 2.025792 2.303542
H  -3.82139 1.079159 -2.03274
H  -4.238771 1.230931 -0.337359
H  -1.574572 0.824211 -2.598743
H  -0.634204 0.167227 -1.276022
H  -2.771012 -1.126309 -1.628152
H  -3.127188 -1.017647 0.07717
H  -0.595889 3.048701 -2.283024
H  0.298529 2.501134 -0.880093
H  -4.733262 -2.435405 -1.224545
H  -5.225682 -1.039291 -2.146522
H  1.490189 0.812408 -2.30006
H  0.647312 1.411676 -3.711657
H  -5.542674 -1.3170 0.893345
H  -6.826732 -1.563187 -0.283447
H  -6.137881 0.033995 -0.063668
H  2.915362 2.427111 -3.565052
H  2.555136 3.048818 -1.958922
H  1.697784 3.681868 -3.360606
H  -2.656161 -1.018124 2.259648
H  -3.479709 0.542151 2.402799
H  -2.305451 0.040963 3.625434
totalener: -1514.90112663 hartree
nucrepener: 2811.91837736 hartree
electener: -4326.81950399 hartree
oneelecener: -7661.85856907 hartree
twoeener: 3335.03906508 hartree
kineticenergy: 1509.14342157 hartree
xcener: -129.020063415906 hartree
chargesum: -0.0000000
charge: 0.039068 -0.325459 -0.312849 -0.376192 -0.121754 -0.181392 0.319912 -0.163148 -0.058609 0.295787 -0.284666 -0.290722 -0.146066 0.078716 -0.113874 -0.178963 -0.117909 -0.112374 -0.110173 -0.130830 -0.100538 -0.063263 0.425716 -0.256544 -0.266806 -0.189179 0.079909 0.090624 0.092298 0.096124 0.089675 0.083871 0.091713 0.115250 0.117480 0.118845 0.119889 0.081812 0.089720 0.086281 0.080140 0.073683 0.075799 0.074170 0.076877 0.069547 0.052666 0.031711 0.059675 0.073754 0.089914 0.075292 0.080682 0.080657 0.073855 0.102085 0.098129 0.119986
qa: 0.0391 -0.3255 -0.3128 -0.3762 -0.1218 -0.1814 0.3199 -0.1631 -0.0586 0.2958 -0.2847 -0.2907 -0.1461 0.0787 -0.1139 -0.1790 -0.1179 -0.1124 -0.1102 -0.1308 -0.1005 -0.0633 0.4257 -0.2565 -0.2668 -0.1892 0.0799 0.0906 0.0923 0.0961 0.0897 0.0839 0.0917 0.1153 0.1175 0.1188 0.1199 0.0818 0.0897 0.0863 0.0801 0.0737 0.0758 0.0742 0.0769 0.0695 0.0527 0.0317 0.0597 0.0738 0.0899 0.0753 0.0807 0.0807 0.0739 0.1021 0.0981 0.1200
va: 2.3608 2.0740 2.0724 2.1426 3.0309 3.1338 3.8316 4.0129 3.7124 3.8323 3.9319 3.9720 4.0105 3.8549 3.9367 4.0609 3.9322 3.9299 3.8203 3.8867 3.9006 3.8759 4.3076 3.9334 3.9664 3.9146 1.0052 1.0027 1.0094 1.0075 1.0059 1.0063 1.0144 1.0030 1.0047 1.0010 1.0066 1.0013 1.0194 0.9952 1.0012 1.0207 1.0132 1.0188 1.0244 1.0058 1.0103 1.0147 1.0066 1.0040 1.0078 1.0025 1.0059 1.0032 1.0027 0.9879 1.0077 1.0040
dispcorr: -0.034041988 hartree
energy: -1514.935168620161
dipole: -14.81427 14.76224 -0.05203 -11.28818 10.50131 -0.78687 -22.31839 21.28245 -1.03594
magnitude: 1.30193 au
magnitude: 3.30925 debye
