program: Gaussian 09
title: 000065093
version: EM64L-G09RevD.01
frameworkgroup: C1[X(C10H8N2S2)]
method: RPBEPBE
basis: SDD
operation: Freq
keyword: #p
keyword: freq=noraman
keyword: PBEPBE/SDD
title: #p freq=noraman PBEPBE/SDD
converged: YES YES NO NO
title: Mulliken charges:
elementType: S S N N C C C C C C C C C C H H H H H H H H
charge: 0.072126 0.072078 0.054398 0.054424 -0.236269 -0.236226 -0.161523 -0.161550 -0.162016 -0.162014 -0.183313 -0.183319 -0.348332 -0.348336 0.245631 0.245626 0.242200 0.242197 0.233415 0.233413 0.243695 0.243695
chargesum: 0.00000
title: Mulliken charges with hydrogens summed into heavy atoms:
elementType: S S N N C C C C C C C C C C
charge: 0.072126 0.072078 0.054398 0.054424 -0.236269 -0.236226 0.084108 0.084076 0.080184 0.080182 0.050102 0.050094 -0.104637 -0.104641
polarizability: 2.15333651e+02 -1.39400172e-02 1.42700718e+02 -2.07167706e+01 5.26184365e-04 1.09930159e+02
1716.lowfreq: -0.0010 0.0016 0.0024 5.5100 10.2808 15.3372 25.2822 26.6997 45.6849
frequency: 25.1938 25.5702 45.6825 101.0440 119.6782 156.1260 182.6866 234.5865 328.8377 397.0176 399.9653 401.7359 409.6289 460.1062 474.3522 484.9206 604.3950 605.6042 695.7824 696.4059 740.1248 742.9850 762.1171 765.7204 881.2234 881.8227 946.3551 946.6039 951.1160 951.5437 990.7977 990.8310 1033.7888 1033.9607 1077.3467 1077.7138 1102.3696 1102.4250 1164.6899 1164.8284 1278.4342 1280.2268 1320.8367 1321.7583 1396.0925 1396.2231 1429.9821 1432.4145 1552.1712 1552.2520 1563.1595 1567.9747 3134.7706 3134.9154 3141.9342 3141.9709 3158.5478 3158.5672 3176.1139 3176.3293
redmass: 6.0923 4.6566 4.4841 9.1316 8.4599 5.5282 6.4325 5.8032 8.9422 14.6434 3.3731 3.3562 12.3586 16.9098 3.2358 3.3527 7.5615 7.5970 7.0632 7.0329 2.6693 2.2782 1.5584 1.7507 1.2897 1.2923 6.1071 6.3578 1.4348 1.4487 1.3383 1.3382 2.8384 2.8351 2.0698 2.0352 2.4268 2.4492 1.0752 1.0773 1.5318 1.5300 10.7966 10.9875 1.8637 1.8562 1.8960 1.8974 5.6061 5.6538 5.7120 5.8806 1.0876 1.0875 1.0895 1.0895 1.0955 1.0955 1.1015 1.1014
irintensity: 1.4999 3.8017 0.2354 0.5292 0.1658 1.3193 0.4612 2.5424 2.2685 1.3446 6.1506 2.6703 4.0911 3.7062 8.2475 3.7489 1.2578 0.1218 33.8871 13.4357 20.2866 16.3996 90.2824 39.2511 0.0342 0.0000 3.5382 6.1233 0.4916 0.5733 0.1692 0.0710 2.6859 22.4779 24.9407 14.7600 66.8718 22.0565 3.3527 3.3569 2.2588 1.1838 13.7028 7.6337 27.0627 31.9859 104.8444 58.1220 2.7500 29.6212 147.2222 64.4142 9.3145 9.4027 10.2817 1.1085 13.5347 20.8177 33.1243 15.8732
temp: 298.150 k
press: 1.00000 atm
elementType: 16 16 7 7 6 6 6 6 6 6 6 6 6 6 1 1 1 1 1 1 1 1
symmnumber: 1
zpe: 409555.6 jmol-1
zpe.correction: 0.155992 hartree
zpe.thermalcorrener: 0.168535 hartree
zpe.thermalcorrenthalpy: 0.169479 hartree
zpe.thermalcorrgfe: 0.114075 hartree
zpe.sumelectzpe: -1290.483647 hartree
zpe.sumelectthermal: -1290.471103 hartree
zpe.sumelectthermalent: -1290.470159 hartree
zpe.sumelectthermalfe: -1290.525564 hartree
dipole: -0.0009 -2.7274 -0.0010
dipole: 2.7274
quadrupole: -68.1687 -92.3437 -94.6577
quadrupole: -0.0043 -5.4539 0.0000
quadrupole: 16.8880 -7.2870 -9.6010 -0.0043 -5.4539 0.0000
hfenergy: -1290.6396386 hartree
pointgroup: C01 [X(C10H8N2S2)]
dipole: -0.000729 -1.0730447 -0.0009376 debye
dipolederiv: -0.2711364 -0.2150858 -0.0108795 -0.3383868 -0.2555621 0.0661501 -0.1038487 0.0326095 0.0370309 -0.2706861 0.2151088 -0.0107218 0.3385325 -0.2559467 -0.0664862 -0.1032036 -0.0329088 0.0367464 -0.3452893 -0.0936435 0.0607832 -0.4400545 -0.5268557 -0.0933765 -0.3306969 -0.353388 -0.2958832 -0.3451366 0.093671 0.0608536 0.4404643 -0.5275044 0.0929666 -0.3301909 0.3533273 -0.2956134 0.7569965 0.5097022 -0.0459122 0.9179997 0.614909 -0.0024739 0.2613214 0.1620665 -0.0097261 0.7563449 -0.5097717 -0.0464723 -0.9184381 0.6158281 0.0032921 0.260085 -0.1614554 -0.009768 -0.4924958 -0.2497481 0.0138014 -0.3784095 -0.2336345 0.1130982 0.0365996 0.1572848 0.0061912 -0.4922767 0.2497287 0.014145 0.3783031 -0.2338388 -0.1133225 0.0370363 -0.1575407 0.0061434 0.1140476 0.1109189 -0.1080325 0.2551951 0.1416853 0.0631183 0.0198445 0.1440635 0.0855618 0.113889 -0.1109754 -0.1081307 -0.2551667 0.1418992 -0.0629778 0.0197163 -0.1439889 0.085569 -0.1280889 0.1323045 0.1006389 -0.050215 -0.1067158 0.0264027 -0.0665876 -0.1080315 -0.2316805 -0.1281117 -0.1322728 0.1005607 0.0502295 -0.1067901 -0.0263444 -0.0665406 0.1081356 -0.2316873 0.1169756 0.036638 -0.16978 0.2253457 0.1975852 0.1105721 0.038758 0.2487976 0.2456739 0.1168786 -0.0366834 -0.1698604 -0.2254647 0.1979681 -0.1104404 0.0386101 -0.2488101 0.2455735 0.1528534 -0.0235216 0.0010899 -0.0000736 0.0465013 -0.1114165 0.0220303 -0.0949726 0.0328767 0.1528916 0.023583 0.0010476 0.0001042 0.0464592 0.1114085 0.0219357 0.094953 0.0328832 -0.0181852 -0.0420622 0.1191002 -0.0566813 0.1086824 0.0037346 0.1175862 -0.0021052 0.0277464 -0.0179994 0.0420616 0.119129 0.0566881 0.1086544 -0.0037788 0.1176409 0.0020682 0.0275779 0.0224442 -0.1274549 0.0028091 -0.1390202 0.0036012 -0.0437813 0.0140966 -0.038565 0.1154676 0.0225048 0.1274834 0.0029285 0.1390258 0.0034946 0.0436725 0.0142063 0.0384384 0.1155014 0.0917797 -0.005943 0.0364614 -0.0552158 0.0098527 -0.0950632 -0.0092026 -0.1208602 -0.0131407 0.0918002 0.0059623 0.0364409 0.055238 0.0097273 0.0950459 -0.0091963 0.1208821 -0.013044 unknown
polarizability: 196.6399765|-0.0004542|142.7007037|-45.2781348|0.0252945|128.6238484 unknown
InChI: InChI=1S/C10H8N2S2/c1-3-7-11-9(5-1)13-14-10-6-2-4-8-12-10/h1-8H
charge 0 multiplicity 1
22 atoms
S  -0.603558 1.913893 0.941391
S  0.604717 1.914722 -0.938531
N  -1.669949 -0.286321 -0.387034
N  1.670775 -0.286867 0.387908
C  -1.806874 0.538382 0.670707
C  1.807353 0.538286 -0.669503
C  -2.835892 0.410616 1.642259
C  2.835587 0.410448 -1.641885
C  -3.754894 -0.647007 1.488522
C  3.754355 -0.647516 -1.489134
C  -3.626426 -1.525827 0.384248
C  3.626329 -1.526722 -0.385113
C  -2.572603 -1.301683 -0.526775
C  2.573092 -1.302674 0.526603
H  -2.914824 1.110616 2.479863
H  2.914041 1.11057 -2.479431
H  -4.561447 -0.778911 2.217427
H  4.560364 -0.779431 -2.218639
H  -4.32254 -2.355725 0.231811
H  4.32231 -2.356869 -0.233424
H  -2.430385 -1.946071 -1.401514
H  2.43107 -1.947507 1.401044
