program: Orca
programVersion: 5.0.2
elementType: S O O O N N C C C C C C C C C C C C C C C C C C C C H H H H H H H H H H H H H H H H H H H H H H H H H H H H H H H H
charge: 0
multiplicity: 1
keywords: wb97x-d3
keywords: def2-TZVPP
keywords: def2/J RIJCOSX
keywords: DEFGRID2
keywords: scfconv7
keywords: smallprint printgap noloewdin
keywords: NOSOSCF
formula: C20H32N2O3S
InChI: InChI=1/C20H32N2O3S/c1-6-8-13-22(14-9-7-2)26-21(5)19(23)24-17-12-10-11-16-15-20(3,4)25-18(16)17/h10-12H,6-9,13-15H2,1-5H3
58 atoms
S  -1.488635 2.22717 0.95657
O  1.065622 -1.564065 -0.032025
O  0.908293 0.820923 1.522179
O  0.006178 -0.844503 2.743282
N  -1.518007 1.77771 -0.631378
N  -1.301893 0.827305 1.936128
C  1.426213 -2.915262 -0.414248
C  2.974228 -2.914197 -0.435836
C  3.29302 -1.743316 0.4453
C  2.118143 -1.030674 0.609655
C  0.802813 -3.195444 -1.765823
C  0.893049 -3.849733 0.662169
C  4.463498 -1.302548 1.031746
C  2.074437 0.11473 1.383758
C  4.433308 -0.138141 1.792599
C  3.246218 0.560769 1.972204
C  -2.657675 1.035925 -1.145424
C  -0.262195 1.662187 -1.365319
C  -2.436374 -0.4712 -1.258463
C  -0.382214 2.144074 -2.805508
C  -3.694113 -1.226212 -1.681006
C  -0.859803 3.583656 -2.936841
C  -0.117081 0.174584 2.122386
C  -4.778663 -1.273486 -0.612138
C  -0.900545 4.057216 -4.382127
C  -2.483186 0.188223 2.493083
H  3.364175 -2.762906 -1.4477
H  3.380444 -3.8583 -0.068946
H  1.059308 -4.202079 -2.097014
H  1.158345 -2.491466 -2.518838
H  -0.284899 -3.127497 -1.719625
H  1.13374 -4.88622 0.421685
H  -0.189879 -3.762349 0.749712
H  1.323985 -3.61618 1.636598
H  5.388278 -1.850596 0.905336
H  5.337204 0.223139 2.263244
H  3.220976 1.456476 2.578795
H  -2.926637 1.42914 -2.133008
H  -3.503951 1.254746 -0.492996
H  0.119302 0.63598 -1.350059
H  0.473191 2.275737 -0.844721
H  -1.646082 -0.66493 -1.988951
H  -2.06589 -0.867391 -0.308391
H  0.606886 2.042145 -3.263187
H  -1.036687 1.482019 -3.38326
H  -3.416747 -2.249337 -1.946597
H  -4.097967 -0.781948 -2.596451
H  -1.850368 3.685486 -2.487328
H  -0.201183 4.234577 -2.354109
H  -5.14862 -0.281358 -0.351131
H  -4.405463 -1.735047 0.30383
H  -5.63647 -1.857142 -0.946495
H  0.087078 4.012332 -4.844336
H  -1.2511 5.086719 -4.456408
H  -1.570115 3.439199 -4.983189
H  -2.341004 -0.046479 3.546508
H  -2.732687 -0.736796 1.969362
H  -3.318735 0.876014 2.399248
totalener: -1514.89996655 hartree
nucrepener: 2801.28608005 hartree
electener: -4316.18604660 hartree
oneelecener: -7640.50099058 hartree
twoeener: 3324.31494398 hartree
kineticenergy: 1509.14342914 hartree
xcener: -129.021797782317 hartree
chargesum: -0.0000000
charge: 0.037131 -0.335371 -0.316973 -0.379097 -0.131717 -0.176480 0.326218 -0.147271 -0.088064 0.299690 -0.293509 -0.297051 -0.165101 0.125703 -0.103109 -0.189724 -0.132492 -0.112906 -0.113994 -0.118554 -0.086328 -0.080793 0.424477 -0.264093 -0.256111 -0.167612 0.078904 0.088934 0.098912 0.090527 0.088373 0.085094 0.091091 0.117363 0.116184 0.118700 0.120681 0.085460 0.093342 0.082002 0.103339 0.072359 0.065122 0.076033 0.059179 0.065916 0.053834 0.060624 0.057715 0.075055 0.073226 0.093034 0.071906 0.085700 0.070777 0.120228 0.088708 0.094811
qa: 0.0371 -0.3354 -0.3170 -0.3791 -0.1317 -0.1765 0.3262 -0.1473 -0.0881 0.2997 -0.2935 -0.2971 -0.1651 0.1257 -0.1031 -0.1897 -0.1325 -0.1129 -0.1140 -0.1186 -0.0863 -0.0808 0.4245 -0.2641 -0.2561 -0.1676 0.0789 0.0889 0.0989 0.0905 0.0884 0.0851 0.0911 0.1174 0.1162 0.1187 0.1207 0.0855 0.0933 0.0820 0.1033 0.0724 0.0651 0.0760 0.0592 0.0659 0.0538 0.0606 0.0577 0.0751 0.0732 0.0930 0.0719 0.0857 0.0708 0.1202 0.0887 0.0948
va: 2.3622 2.0881 2.0808 2.1341 3.0199 3.1492 3.8229 3.9907 3.7124 3.8865 3.9258 3.9759 4.0148 3.8598 3.9286 4.0738 3.9576 3.9229 3.8357 3.8647 3.8919 3.8667 4.3058 3.9374 3.9484 3.9051 1.0050 1.0034 1.0090 1.0085 1.0070 1.0072 1.0128 1.0041 1.0060 1.0011 1.0074 0.9924 1.0199 1.0176 1.0140 1.0112 1.0184 1.0137 1.0041 1.0071 1.0095 1.0158 1.0120 1.0030 1.0034 1.0083 1.0030 1.0061 1.0030 1.0048 0.9923 1.0130
dispcorr: -0.034127838 hartree
energy: -1514.934094385366
dipole: -20.34713 20.30556 -0.04157 -6.94900 6.22954 -0.71946 -28.79833 27.64772 -1.15061
magnitude: 1.35767 au
magnitude: 3.45092 debye
