program: Orca
programVersion: 5.0.2
elementType: S O O O N N C C C C C C C C C C C C C C C C C C C C H H H H H H H H H H H H H H H H H H H H H H H H H H H H H H H H
charge: 0
multiplicity: 1
keywords: wb97x-d3
keywords: def2-TZVPP
keywords: def2/J RIJCOSX
keywords: DEFGRID2
keywords: scfconv7
keywords: smallprint printgap noloewdin
keywords: NOSOSCF
formula: C20H32N2O3S
InChI: InChI=1/C20H32N2O3S/c1-6-8-13-22(14-9-7-2)26-21(5)19(23)24-17-12-10-11-16-15-20(3,4)25-18(16)17/h10-12H,6-9,13-15H2,1-5H3
58 atoms
S  -1.852969 1.843269 1.015038
O  1.588164 -1.310808 -0.049425
O  0.825779 1.036172 1.395951
O  0.431504 -0.726727 2.742001
N  -2.31664 1.136268 -0.415375
N  -1.280754 0.601311 2.049208
C  2.306341 -2.504783 -0.452193
C  3.787833 -2.065014 -0.536429
C  3.791972 -0.819992 0.299577
C  2.469879 -0.470746 0.514313
C  1.735424 -2.954666 -1.781192
C  2.104228 -3.545767 0.638742
C  4.811788 -0.029539 0.792507
C  2.13388 0.660896 1.234849
C  4.483223 1.115784 1.510434
C  3.154495 1.454221 1.732712
C  -3.564563 0.384455 -0.446282
C  -1.268792 0.644817 -1.30577
C  -4.405314 0.699816 -1.677251
C  -0.382633 1.754647 -1.847964
C  -5.694988 -0.111247 -1.718612
C  0.797796 1.230743 -2.660031
C  0.030132 0.210796 2.110879
C  -6.569544 0.233221 -2.915289
C  0.405184 0.431974 -3.896355
C  -2.233347 -0.204808 2.796166
H  4.086481 -1.846703 -1.566825
H  4.457586 -2.841974 -0.163769
H  0.675566 -3.196032 -1.693424
H  2.253606 -3.848525 -2.129707
H  1.847492 -2.180613 -2.541583
H  2.615476 -4.474118 0.379938
H  1.045596 -3.766167 0.775168
H  2.497198 -3.195891 1.594317
H  5.848172 -0.291123 0.621988
H  5.265141 1.748419 1.907057
H  2.90062 2.342942 2.29539
H  -4.138927 0.644077 0.444427
H  -3.370881 -0.696378 -0.388004
H  -1.767812 0.144365 -2.138195
H  -0.660544 -0.124402 -0.814596
H  -4.633525 1.769141 -1.67766
H  -3.833316 0.51013 -2.590871
H  -0.993285 2.42648 -2.459048
H  -0.001088 2.349665 -1.016209
H  -6.25967 0.053438 -0.795863
H  -5.454748 -1.178614 -1.737086
H  1.414264 2.079988 -2.964023
H  1.43097 0.615994 -2.015585
H  -6.046515 0.048947 -3.855025
H  -6.859354 1.284894 -2.903495
H  -7.484052 -0.359848 -2.92617
H  1.282758 0.161404 -4.48471
H  -0.259373 1.004799 -4.5461
H  -0.106393 -0.496874 -3.639419
H  -2.444908 -1.152256 2.297175
H  -3.159258 0.356963 2.886289
H  -1.858738 -0.422308 3.794462
totalener: -1514.90155812 hartree
nucrepener: 2768.61145793 hartree
electener: -4283.51301604 hartree
oneelecener: -7575.23664980 hartree
twoeener: 3291.72363376 hartree
kineticenergy: 1509.14575141 hartree
xcener: -129.017715602990 hartree
chargesum: -0.0000000
charge: 0.040264 -0.323947 -0.308048 -0.377325 -0.119826 -0.176127 0.324654 -0.162917 -0.052105 0.272124 -0.287484 -0.290242 -0.154105 0.093107 -0.113419 -0.178736 -0.105806 -0.163927 -0.097884 -0.098010 -0.082720 -0.086075 0.420280 -0.257229 -0.289614 -0.180183 0.079386 0.090570 0.094981 0.097859 0.086461 0.083922 0.092230 0.114456 0.116538 0.119458 0.120487 0.082932 0.084527 0.095503 0.101404 0.061978 0.054237 0.070778 0.084582 0.055551 0.054064 0.072950 0.040212 0.073245 0.075378 0.085981 0.090620 0.088235 0.068954 0.104999 0.096007 0.116815
qa: 0.0403 -0.3239 -0.3080 -0.3773 -0.1198 -0.1761 0.3247 -0.1629 -0.0521 0.2721 -0.2875 -0.2902 -0.1541 0.0931 -0.1134 -0.1787 -0.1058 -0.1639 -0.0979 -0.0980 -0.0827 -0.0861 0.4203 -0.2572 -0.2896 -0.1802 0.0794 0.0906 0.0950 0.0979 0.0865 0.0839 0.0922 0.1145 0.1165 0.1195 0.1205 0.0829 0.0845 0.0955 0.1014 0.0620 0.0542 0.0708 0.0846 0.0556 0.0541 0.0729 0.0402 0.0732 0.0754 0.0860 0.0906 0.0882 0.0690 0.1050 0.0960 0.1168
va: 2.3494 2.0742 2.0818 2.1363 3.0209 3.1523 3.8200 4.0175 3.7039 3.8579 3.9297 3.9717 4.0134 3.8870 3.9361 4.0575 3.9403 3.9456 3.8681 3.8416 3.8762 3.8759 4.3067 3.9578 3.9328 3.9037 1.0049 1.0028 1.0090 1.0091 1.0028 1.0064 1.0147 1.0035 1.0053 1.0010 1.0066 1.0142 0.9942 0.9865 1.0223 1.0241 1.0180 1.0183 1.0303 1.0072 1.0090 1.0120 1.0245 1.0033 1.0028 1.0055 1.0042 1.0059 0.9973 0.9879 1.0095 1.0073
dispcorr: -0.032926767 hartree
energy: -1514.934484883060
dipole: -20.97604 20.87571 -0.10033 -12.45506 11.71063 -0.74443 -29.80547 28.87060 -0.93487
magnitude: 1.19926 au
magnitude: 3.04828 debye
