program: Orca
programVersion: 5.0.2
elementType: S O O O N N C C C C C C C C C C C C C C C C C C C C H H H H H H H H H H H H H H H H H H H H H H H H H H H H H H H H
charge: 0
multiplicity: 1
keywords: wb97x-d3
keywords: def2-TZVPP
keywords: def2/J RIJCOSX
keywords: DEFGRID2
keywords: scfconv7
keywords: smallprint printgap noloewdin
keywords: NOSOSCF
formula: C20H32N2O3S
InChI: InChI=1/C20H32N2O3S/c1-6-8-13-22(14-9-7-2)26-21(5)19(23)24-17-12-10-11-16-15-20(3,4)25-18(16)17/h10-12H,6-9,13-15H2,1-5H3
58 atoms
S  -1.19773 2.347398 0.247624
O  1.45059 -1.564857 -0.335837
O  0.284238 0.282735 1.495815
O  2.346312 1.074056 1.053874
N  -1.613419 1.70021 -1.231454
N  0.506684 2.238219 0.404152
C  2.321005 -2.579226 -0.898955
C  2.281421 -3.742144 0.121931
C  1.801968 -3.050752 1.363714
C  1.334993 -1.806011 0.979119
C  3.715574 -1.978463 -0.992303
C  1.767369 -2.949236 -2.25962
C  1.724571 -3.446158 2.684883
C  0.796235 -0.923771 1.8973
C  1.175781 -2.56844 3.614598
C  0.71901 -1.316125 3.223391
C  -1.552556 0.247822 -1.379114
C  -1.218547 2.444838 -2.422741
C  -2.40962 -0.506543 -0.37759
C  -1.736231 3.87383 -2.493732
C  -2.317512 -2.01438 -0.583189
C  -3.24597 4.02411 -2.676167
C  1.153888 1.180498 0.983311
C  -3.091232 -2.793674 0.469885
C  -4.094969 3.711727 -1.449591
C  1.358738 3.301406 -0.109517
H  3.261167 -4.209484 0.234466
H  1.580977 -4.525367 -0.185665
H  4.08853 -1.693216 -0.007585
H  3.714323 -1.086027 -1.618059
H  4.412802 -2.697274 -1.424991
H  2.390466 -3.713794 -2.72452
H  1.746347 -2.085182 -2.924591
H  0.753158 -3.341893 -2.179661
H  2.081042 -4.420093 2.994524
H  1.108879 -2.855748 4.654737
H  0.299371 -0.63288 3.949968
H  -0.518235 -0.115482 -1.342741
H  -1.919469 0.02234 -2.384811
H  -1.614361 1.897775 -3.283389
H  -0.125826 2.440941 -2.543049
H  -2.102217 -0.264116 0.640401
H  -3.448709 -0.17774 -0.476638
H  -1.410852 4.441732 -1.618052
H  -1.236675 4.336258 -3.350028
H  -1.266771 -2.316784 -0.559042
H  -2.687162 -2.275772 -1.579865
H  -3.442571 5.055706 -2.980614
H  -3.57065 3.402368 -3.516866
H  -3.025791 -3.868957 0.302335
H  -4.148604 -2.523819 0.4678
H  -2.701383 -2.592188 1.468691
H  -3.758327 4.283759 -0.583375
H  -4.053954 2.658313 -1.181249
H  -5.139149 3.971265 -1.628821
H  1.941901 2.970772 -0.969723
H  2.050585 3.654691 0.654325
H  0.725451 4.130155 -0.412789
totalener: -1514.89895608 hartree
nucrepener: 2809.79891397 hartree
electener: -4324.69787005 hartree
oneelecener: -7657.71828775 hartree
twoeener: 3333.02041771 hartree
kineticenergy: 1509.14809574 hartree
xcener: -129.019036994040 hartree
chargesum: -0.0000000
charge: 0.045375 -0.327721 -0.311666 -0.376087 -0.118813 -0.174684 0.314358 -0.157913 -0.059882 0.303570 -0.291216 -0.283366 -0.146770 0.076352 -0.112902 -0.182057 -0.132806 -0.140458 -0.119868 -0.121351 -0.066292 -0.076357 0.421089 -0.262415 -0.260287 -0.182008 0.090609 0.079387 0.114944 0.092302 0.083801 0.096930 0.094547 0.089892 0.116745 0.119403 0.120276 0.088194 0.083166 0.085073 0.100580 0.078822 0.077303 0.063086 0.078226 0.024907 0.063112 0.068305 0.042917 0.079845 0.074807 0.080504 0.076454 0.074043 0.085452 0.106701 0.116257 0.097583
qa: 0.0454 -0.3277 -0.3117 -0.3761 -0.1188 -0.1747 0.3144 -0.1579 -0.0599 0.3036 -0.2912 -0.2834 -0.1468 0.0764 -0.1129 -0.1821 -0.1328 -0.1405 -0.1199 -0.1214 -0.0663 -0.0764 0.4211 -0.2624 -0.2603 -0.1820 0.0906 0.0794 0.1149 0.0923 0.0838 0.0969 0.0945 0.0899 0.1167 0.1194 0.1203 0.0882 0.0832 0.0851 0.1006 0.0788 0.0773 0.0631 0.0782 0.0249 0.0631 0.0683 0.0429 0.0798 0.0748 0.0805 0.0765 0.0740 0.0855 0.1067 0.1163 0.0976
va: 2.3554 2.0721 2.0728 2.1414 2.9922 3.1693 3.8399 4.0083 3.7095 3.8170 3.9721 3.9277 4.0117 3.8611 3.9368 4.0571 3.9240 3.9490 3.8526 3.8740 3.8898 3.8755 4.3082 3.9644 3.9279 3.9100 1.0028 1.0056 1.0031 1.0145 1.0066 1.0074 1.0094 1.0046 1.0050 1.0009 1.0067 1.0132 1.0044 1.0011 0.9948 1.0242 1.0150 1.0289 1.0127 1.0195 1.0072 1.0048 1.0122 1.0061 1.0033 1.0034 1.0058 1.0192 1.0093 0.9923 1.0041 1.0005
dispcorr: -0.034218331 hartree
energy: -1514.933174413148
dipole: -15.02043 15.12676 0.10634 -1.58467 0.93439 -0.65027 -22.89840 21.89723 -1.00117
magnitude: 1.19854 au
magnitude: 3.04645 debye
