program: Orca
programVersion: 5.0.2
elementType: S O O O N N C C C C C C C C C C C C C C C C C C C C H H H H H H H H H H H H H H H H H H H H H H H H H H H H H H H H
charge: 0
multiplicity: 1
keywords: wb97x-d3
keywords: def2-TZVPP
keywords: def2/J RIJCOSX
keywords: DEFGRID2
keywords: scfconv7
keywords: smallprint printgap noloewdin
keywords: NOSOSCF
formula: C20H32N2O3S
InChI: InChI=1/C20H32N2O3S/c1-6-8-13-22(14-9-7-2)26-21(5)19(23)24-17-12-10-11-16-15-20(3,4)25-18(16)17/h10-12H,6-9,13-15H2,1-5H3
58 atoms
S  -1.09829 2.401229 0.95189
O  1.307906 -1.660774 -0.19162
O  0.516656 0.252749 1.787842
O  2.483742 0.999124 0.98387
N  -1.760948 1.887604 -0.478587
N  0.605479 2.273471 0.810443
C  2.045214 -2.705606 -0.876804
C  2.196965 -3.836123 0.17029
C  1.949083 -3.107409 1.456633
C  1.431816 -1.865605 1.128766
C  3.398374 -2.125605 -1.259939
C  1.239644 -3.118637 -2.091907
C  2.107057 -3.472715 2.779178
C  1.0749 -0.957407 2.108589
C  1.738288 -2.570115 3.771178
C  1.231223 -1.321441 3.436302
C  -1.740827 0.458896 -0.779012
C  -1.72315 2.777153 -1.631277
C  -2.556997 -0.366312 0.202787
C  -3.074752 2.879747 -2.326838
C  -2.435081 -1.868589 -0.033259
C  -3.035441 3.798446 -3.541775
C  1.308674 1.153904 1.167313
C  -2.927179 -2.329902 -1.399224
C  -4.387359 3.920852 -4.230546
C  1.347222 3.329256 0.140276
H  3.183819 -4.299555 0.117098
H  1.458209 -4.62984 0.018897
H  3.994829 -2.868017 -1.792767
H  3.955794 -1.810772 -0.376417
H  3.279389 -1.256108 -1.906299
H  1.753795 -3.91518 -2.630864
H  1.106733 -2.282885 -2.780035
H  0.253068 -3.486485 -1.8059
H  2.505808 -4.444127 3.042115
H  1.853997 -2.834226 4.813265
H  0.950433 -0.617391 4.208578
H  -0.712818 0.07913 -0.832415
H  -2.155735 0.340302 -1.782287
H  -0.953023 2.455685 -2.346991
H  -1.428706 3.769276 -1.285009
H  -2.230349 -0.142499 1.219877
H  -3.605285 -0.059197 0.135926
H  -3.418994 1.887762 -2.63657
H  -3.809811 3.244374 -1.603744
H  -3.00016 -2.387358 0.744599
H  -1.393411 -2.170768 0.100939
H  -2.691175 4.791804 -3.237468
H  -2.293054 3.429554 -4.256395
H  -2.911972 -3.417516 -1.477969
H  -2.308784 -1.942306 -2.210212
H  -3.952769 -2.003341 -1.5829
H  -4.743908 2.950522 -4.580274
H  -4.337313 4.583813 -5.09442
H  -5.141944 4.321033 -3.551198
H  0.772307 4.249065 0.209813
H  1.518397 3.102222 -0.913731
H  2.313278 3.485196 0.615953
totalener: -1514.90173770 hartree
nucrepener: 2758.18466560 hartree
electener: -4273.08640331 hartree
oneelecener: -7554.42561251 hartree
twoeener: 3281.33920921 hartree
kineticenergy: 1509.13957633 hartree
xcener: -129.016573829093 hartree
chargesum: -0.0000000
charge: 0.039883 -0.325456 -0.310053 -0.379117 -0.122698 -0.172722 0.320206 -0.161277 -0.058919 0.280994 -0.289953 -0.284599 -0.151282 0.091084 -0.115625 -0.174992 -0.159755 -0.105339 -0.099197 -0.093688 -0.085152 -0.083443 0.420439 -0.288280 -0.255833 -0.184446 0.090101 0.079838 0.082969 0.115137 0.092312 0.097302 0.094184 0.087167 0.116957 0.118997 0.119765 0.100214 0.094747 0.085533 0.081601 0.084553 0.071828 0.053125 0.061581 0.072390 0.037875 0.056153 0.052990 0.088624 0.071933 0.087398 0.072901 0.085900 0.075085 0.097972 0.105283 0.116804
qa: 0.0399 -0.3255 -0.3101 -0.3791 -0.1227 -0.1727 0.3202 -0.1613 -0.0589 0.2810 -0.2900 -0.2846 -0.1513 0.0911 -0.1156 -0.1750 -0.1598 -0.1053 -0.0992 -0.0937 -0.0852 -0.0834 0.4204 -0.2883 -0.2558 -0.1844 0.0901 0.0798 0.0830 0.1151 0.0923 0.0973 0.0942 0.0872 0.1170 0.1190 0.1198 0.1002 0.0947 0.0855 0.0816 0.0846 0.0718 0.0531 0.0616 0.0724 0.0379 0.0562 0.0530 0.0886 0.0719 0.0874 0.0729 0.0859 0.0751 0.0980 0.1053 0.1168
va: 2.3531 2.0784 2.0802 2.1347 3.0206 3.1514 3.8243 4.0154 3.7104 3.8659 3.9724 3.9300 4.0110 3.8861 3.9394 4.0593 3.9383 3.9342 3.8456 3.8665 3.8778 3.8785 4.3053 3.9336 3.9575 3.9040 1.0026 1.0048 1.0065 1.0032 1.0143 1.0084 1.0096 1.0034 1.0052 1.0012 1.0064 1.0213 0.9871 0.9946 1.0147 1.0301 1.0179 1.0179 1.0246 1.0114 1.0266 1.0071 1.0093 1.0052 0.9972 1.0051 1.0032 1.0054 1.0029 1.0086 0.9867 1.0089
dispcorr: -0.032499635 hartree
energy: -1514.934237339377
dipole: -19.57627 19.38111 -0.19516 -1.08650 0.53096 -0.55553 -33.03327 32.03042 -1.00285
magnitude: 1.16293 au
magnitude: 2.95593 debye
