program: Orca
programVersion: 5.0.2
elementType: S O O O N N C C C C C C C C C C C C C C C C C C C C H H H H H H H H H H H H H H H H H H H H H H H H H H H H H H H H
charge: 0
multiplicity: 1
keywords: wb97x-d3
keywords: def2-TZVPP
keywords: def2/J RIJCOSX
keywords: DEFGRID2
keywords: scfconv7
keywords: smallprint printgap noloewdin
keywords: NOSOSCF
formula: C20H32N2O3S
InChI: InChI=1/C20H32N2O3S/c1-6-8-13-22(14-9-7-2)26-21(5)19(23)24-17-12-10-11-16-15-20(3,4)25-18(16)17/h10-12H,6-9,13-15H2,1-5H3
58 atoms
S  -1.699807 2.288084 0.970611
O  0.939828 -1.139474 -0.177766
O  0.746425 1.021066 1.639606
O  -0.124942 -0.63655 2.889155
N  -1.873595 1.581446 -0.511062
N  -1.458785 1.024335 2.100061
C  1.302544 -2.414426 -0.765492
C  2.848483 -2.464944 -0.683158
C  3.138303 -1.439446 0.371669
C  1.970825 -0.726208 0.576135
C  0.776041 -2.428743 -2.185685
C  0.672457 -3.503391 0.089612
C  4.283114 -1.11318 1.072741
C  1.909849 0.312169 1.486353
C  4.234299 -0.062746 1.983514
C  3.054751 0.641493 2.191716
C  -3.186376 1.237198 -1.03235
C  -0.751704 1.581376 -1.436601
C  -3.300547 -0.193184 -1.551942
C  -0.715754 2.796373 -2.357077
C  -2.988198 -1.264222 -0.517298
C  0.504551 2.813131 -3.27351
C  -0.267697 0.373242 2.25811
C  -3.174567 -2.673812 -1.060458
C  0.542348 1.672452 -4.283422
C  -2.600587 0.448949 2.79427
H  3.313271 -2.192731 -1.636214
H  3.201756 -3.465019 -0.425235
H  -0.310188 -2.331756 -2.204414
H  1.035325 -3.367365 -2.676156
H  1.202133 -1.612822 -2.770978
H  -0.411249 -3.389584 0.127216
H  1.048295 -3.466593 1.113109
H  0.896256 -4.489549 -0.319714
H  5.203164 -1.662272 0.919356
H  5.117845 0.205361 2.546011
H  3.016474 1.450331 2.909361
H  -3.472699 1.927794 -1.835481
H  -3.908225 1.387091 -0.22805
H  -0.779126 0.656544 -2.018692
H  0.170399 1.539942 -0.860213
H  -4.323463 -0.323563 -1.920343
H  -2.658785 -0.330539 -2.428344
H  -1.625701 2.842495 -2.964808
H  -0.71279 3.697037 -1.73636
H  -3.640057 -1.124362 0.350358
H  -1.965715 -1.137914 -0.152496
H  0.527478 3.764688 -3.810265
H  1.413385 2.791078 -2.664377
H  -4.201168 -2.843308 -1.389597
H  -2.94335 -3.427082 -0.306634
H  -2.525645 -2.859402 -1.918546
H  0.642792 0.699028 -3.801143
H  1.384557 1.780026 -4.967169
H  -0.367995 1.647495 -4.885776
H  -2.386787 0.328702 3.85521
H  -2.878073 -0.524829 2.390629
H  -3.44131 1.128505 2.685204
totalener: -1514.89732514 hartree
nucrepener: 2847.84690515 hartree
electener: -4362.74423029 hartree
oneelecener: -7733.65185956 hartree
twoeener: 3370.90762927 hartree
kineticenergy: 1509.14781616 hartree
xcener: -129.024410006033 hartree
chargesum: -0.0000000
charge: 0.040072 -0.325427 -0.323691 -0.375677 -0.158444 -0.145124 0.321618 -0.143655 -0.095614 0.288162 -0.296294 -0.295131 -0.159852 0.130236 -0.108292 -0.179359 -0.109472 -0.078549 -0.093467 -0.102785 -0.072883 -0.103005 0.410151 -0.304705 -0.246368 -0.186053 0.080078 0.088975 0.079405 0.104810 0.091678 0.089197 0.118696 0.087973 0.116899 0.119025 0.117903 0.090111 0.085699 0.055616 0.098390 0.076212 0.059517 0.057590 0.071630 0.060440 0.036073 0.068257 0.057244 0.090816 0.093312 0.080460 0.057079 0.088245 0.076279 0.117887 0.103573 0.094536
qa: 0.0401 -0.3254 -0.3237 -0.3757 -0.1584 -0.1451 0.3216 -0.1437 -0.0956 0.2882 -0.2963 -0.2951 -0.1599 0.1302 -0.1083 -0.1794 -0.1095 -0.0785 -0.0935 -0.1028 -0.0729 -0.1030 0.4102 -0.3047 -0.2464 -0.1861 0.0801 0.0890 0.0794 0.1048 0.0917 0.0892 0.1187 0.0880 0.1169 0.1190 0.1179 0.0901 0.0857 0.0556 0.0984 0.0762 0.0595 0.0576 0.0716 0.0604 0.0361 0.0683 0.0572 0.0908 0.0933 0.0805 0.0571 0.0882 0.0763 0.1179 0.1036 0.0945
va: 2.3769 2.1010 2.0795 2.1357 3.0163 3.1414 3.8047 3.9903 3.7350 3.9293 3.9384 3.9866 4.0126 3.8429 3.9346 4.0790 3.9443 3.9488 3.7800 3.9228 3.8419 3.9056 4.3209 3.9637 3.9330 3.9134 1.0042 1.0034 1.0130 1.0106 1.0054 1.0106 1.0030 1.0068 1.0056 1.0010 1.0070 0.9981 1.0156 0.9969 1.0126 1.0162 1.0027 1.0151 1.0205 1.0123 1.0231 1.0075 1.0114 1.0069 1.0016 0.9962 1.0018 1.0079 1.0046 1.0031 0.9886 1.0110
dispcorr: -0.036022505 hartree
energy: -1514.933347643735
dipole: -14.10184 13.99563 -0.10621 -12.61253 12.11538 -0.49715 -30.30668 29.07138 -1.23531
magnitude: 1.33582 au
magnitude: 3.39539 debye
