program: Orca
programVersion: 5.0.2
elementType: S O O O N N C C C C C C C C C C C C C C C C C C C C H H H H H H H H H H H H H H H H H H H H H H H H H H H H H H H H
charge: 0
multiplicity: 1
keywords: wb97x-d3
keywords: def2-TZVPP
keywords: def2/J RIJCOSX
keywords: DEFGRID2
keywords: scfconv7
keywords: smallprint printgap noloewdin
keywords: NOSOSCF
formula: C20H32N2O3S
InChI: InChI=1/C20H32N2O3S/c1-6-8-13-22(14-9-7-2)26-21(5)19(23)24-17-12-10-11-16-15-20(3,4)25-18(16)17/h10-12H,6-9,13-15H2,1-5H3
58 atoms
S  -1.905686 1.389926 0.483532
O  1.727522 -1.688006 -0.106486
O  0.767864 0.705609 1.116643
O  0.321571 -0.908443 2.622753
N  -2.195392 0.571497 -0.93571
N  -1.371482 0.246743 1.643903
C  2.501827 -2.892262 -0.342112
C  3.978845 -2.433005 -0.275656
C  3.869452 -1.135178 0.466937
C  2.527565 -0.796895 0.498684
C  2.106126 -3.438306 -1.698816
C  2.17455 -3.864214 0.781116
C  4.813871 -0.299196 1.029727
C  2.096111 0.363558 1.114199
C  4.389849 0.880345 1.633138
C  3.040166 1.205022 1.678781
C  -3.343527 -0.324972 -0.981506
C  -1.041042 0.142089 -1.72277
C  -4.659829 0.337202 -0.605412
C  -0.108096 1.277824 -2.108859
C  -5.008594 1.542773 -1.467437
C  -0.776243 2.381307 -2.917873
C  -0.056764 -0.067572 1.855737
C  -6.373673 2.124221 -1.130124
C  0.203283 3.472421 -3.326801
C  -2.34243 -0.49019 2.439654
H  4.399902 -2.281091 -1.274597
H  4.604285 -3.170835 0.229836
H  2.299619 -2.71108 -2.487948
H  1.048153 -3.701147 -1.726729
H  2.678534 -4.338982 -1.922978
H  1.110114 -4.098689 0.793715
H  2.434229 -3.443986 1.753733
H  2.726734 -4.796322 0.653141
H  5.865608 -0.553527 1.00296
H  5.111937 1.548154 2.081936
H  2.709669 2.116084 2.160176
H  -3.180726 -1.21857 -0.362686
H  -3.422081 -0.681083 -2.012737
H  -1.440331 -0.305685 -2.637728
H  -0.47764 -0.64837 -1.213488
H  -5.441955 -0.422626 -0.701537
H  -4.655047 0.630022 0.447719
H  0.35604 1.703334 -1.21805
H  0.708991 0.837918 -2.689547
H  -4.982408 1.252316 -2.52247
H  -4.242569 2.311667 -1.349528
H  -1.242385 1.951079 -3.81024
H  -1.590473 2.819322 -2.33657
H  -6.417817 2.452256 -0.090211
H  -7.167895 1.389775 -1.275717
H  -6.605503 2.986485 -1.755439
H  -0.287896 4.258404 -3.900915
H  1.012141 3.073238 -3.941224
H  0.659201 3.939772 -2.452405
H  -3.316636 -0.028336 2.303644
H  -2.087105 -0.458154 3.498219
H  -2.404509 -1.536544 2.135593
totalener: -1514.90196964 hartree
nucrepener: 2763.71304418 hartree
electener: -4278.61501382 hartree
oneelecener: -7565.59086315 hartree
twoeener: 3286.97584933 hartree
kineticenergy: 1509.14970780 hartree
xcener: -129.019300632032 hartree
chargesum: 0.0000000
charge: 0.039525 -0.336884 -0.315896 -0.378876 -0.124152 -0.173548 0.318394 -0.151529 -0.072868 0.328792 -0.283992 -0.292646 -0.159331 0.080882 -0.111025 -0.178134 -0.138382 -0.134929 -0.125340 -0.128398 -0.047976 -0.048374 0.421317 -0.265215 -0.265316 -0.183989 0.080347 0.088915 0.089388 0.092944 0.093167 0.091156 0.116218 0.082612 0.116897 0.119249 0.119186 0.100369 0.086169 0.083255 0.105948 0.068202 0.065783 0.076668 0.065009 0.052752 0.051579 0.047979 0.049864 0.075976 0.071174 0.084765 0.082335 0.071047 0.077474 0.099055 0.117231 0.105180
qa: 0.0395 -0.3369 -0.3159 -0.3789 -0.1242 -0.1735 0.3184 -0.1515 -0.0729 0.3288 -0.2840 -0.2926 -0.1593 0.0809 -0.1110 -0.1781 -0.1384 -0.1349 -0.1253 -0.1284 -0.0480 -0.0484 0.4213 -0.2652 -0.2653 -0.1840 0.0803 0.0889 0.0894 0.0929 0.0932 0.0912 0.1162 0.0826 0.1169 0.1192 0.1192 0.1004 0.0862 0.0833 0.1059 0.0682 0.0658 0.0767 0.0650 0.0528 0.0516 0.0480 0.0499 0.0760 0.0712 0.0848 0.0823 0.0710 0.0775 0.0991 0.1172 0.1052
va: 2.3697 2.0947 2.0713 2.1368 2.9771 3.1733 3.8316 3.9996 3.7157 3.8611 3.9274 3.9724 4.0141 3.8473 3.9359 4.0771 3.9474 3.9296 3.8666 3.8620 3.8518 3.8619 4.3081 3.9612 3.9609 3.9091 1.0045 1.0030 1.0093 1.0095 1.0064 1.0140 1.0033 1.0066 1.0054 1.0012 1.0067 0.9937 1.0023 1.0014 1.0169 1.0170 1.0210 1.0225 1.0158 1.0105 1.0223 1.0101 1.0194 1.0024 1.0028 1.0056 1.0054 1.0029 1.0031 1.0008 1.0049 0.9921
dispcorr: -0.031947672 hartree
energy: -1514.933917313509
dipole: -20.52579 20.58030 0.05452 -1.15359 0.32726 -0.82633 -22.87595 22.04051 -0.83543
magnitude: 1.17633 au
magnitude: 2.98999 debye
