program: Orca
programVersion: 5.0.2
elementType: S O O O N N C C C C C C C C C C C C C C C C C C C C H H H H H H H H H H H H H H H H H H H H H H H H H H H H H H H H
charge: 0
multiplicity: 1
keywords: wb97x-d3
keywords: def2-TZVPP
keywords: def2/J RIJCOSX
keywords: DEFGRID2
keywords: scfconv7
keywords: smallprint printgap noloewdin
keywords: NOSOSCF
formula: C20H32N2O3S
InChI: InChI=1/C20H32N2O3S/c1-6-8-13-22(14-9-7-2)26-21(5)19(23)24-17-12-10-11-16-15-20(3,4)25-18(16)17/h10-12H,6-9,13-15H2,1-5H3
58 atoms
S  -1.965786 1.530229 1.121407
O  1.62689 -1.369608 -0.151499
O  0.759206 0.870946 1.391219
O  0.518474 -0.936128 2.714039
N  -2.467784 0.805515 -0.283228
N  -1.291252 0.306958 2.115979
C  2.404594 -2.502786 -0.612762
C  3.8547 -1.970646 -0.714335
C  3.805544 -0.760979 0.170794
C  2.47037 -0.498479 0.423731
C  1.827378 -2.940918 -1.942973
C  2.292377 -3.590109 0.445127
C  4.787272 0.066996 0.679577
C  2.084094 0.58299 1.193172
C  4.407371 1.161833 1.449362
C  3.066012 1.414384 1.706364
C  -3.707952 0.040643 -0.272142
C  -1.450996 0.358258 -1.22944
C  -4.580414 0.322141 -1.490863
C  -0.649425 1.505676 -1.823079
C  -4.968657 1.787896 -1.629194
C  0.492616 1.036363 -2.719438
C  0.039976 -0.01135 2.11862
C  -5.847319 2.051428 -2.84285
C  0.048244 0.207025 -3.917914
C  -2.171051 -0.553538 2.889522
H  4.11228 -1.694232 -1.741819
H  4.57949 -2.719107 -0.389664
H  0.785101 -3.244182 -1.838767
H  2.385248 -3.792521 -2.333045
H  1.876424 -2.137969 -2.679512
H  2.681978 -3.247825 1.40474
H  2.855653 -4.474647 0.144886
H  1.25297 -3.882417 0.593525
H  5.833798 -0.126634 0.482693
H  5.159379 1.820994 1.860398
H  2.771546 2.263723 2.308727
H  -4.260768 0.317895 0.62698
H  -3.504166 -1.036186 -0.197177
H  -1.971632 -0.169511 -2.030675
H  -0.781071 -0.378719 -0.770489
H  -4.081859 -0.013992 -2.405824
H  -5.480718 -0.294865 -1.40489
H  -1.327719 2.154282 -2.386421
H  -0.237292 2.112756 -1.01496
H  -4.063599 2.395699 -1.690354
H  -5.486995 2.111696 -0.721288
H  1.038516 1.914112 -3.073204
H  1.203602 0.461319 -2.121421
H  -6.108172 3.106769 -2.923719
H  -6.779481 1.485781 -2.79466
H  -5.340572 1.76816 -3.767091
H  0.889148 -0.018771 -4.574575
H  -0.697841 0.736308 -4.513859
H  -0.387865 -0.747002 -3.617839
H  -1.734077 -0.7831 3.859274
H  -2.376004 -1.494808 2.376207
H  -3.1104 -0.029637 3.045818
totalener: -1514.90130108 hartree
nucrepener: 2784.62817891 hartree
electener: -4299.52947998 hartree
oneelecener: -7607.31554694 hartree
twoeener: 3307.78606695 hartree
kineticenergy: 1509.15938438 hartree
xcener: -129.021850160836 hartree
chargesum: -0.0000000
charge: 0.042066 -0.325948 -0.309619 -0.378365 -0.129952 -0.170368 0.320667 -0.156946 -0.059117 0.279539 -0.288588 -0.290062 -0.152588 0.094058 -0.114687 -0.177391 -0.119121 -0.160156 -0.118126 -0.101604 -0.079359 -0.086000 0.418619 -0.259694 -0.293177 -0.180490 0.079185 0.089887 0.095469 0.098881 0.087499 0.114665 0.083650 0.092081 0.116454 0.119256 0.120339 0.089914 0.099275 0.095386 0.102110 0.057782 0.073298 0.070206 0.085375 0.059035 0.056543 0.073743 0.038522 0.085968 0.071357 0.072694 0.090956 0.088848 0.071311 0.116858 0.103659 0.096201
qa: 0.0421 -0.3259 -0.3096 -0.3784 -0.1300 -0.1704 0.3207 -0.1569 -0.0591 0.2795 -0.2886 -0.2901 -0.1526 0.0941 -0.1147 -0.1774 -0.1191 -0.1602 -0.1181 -0.1016 -0.0794 -0.0860 0.4186 -0.2597 -0.2932 -0.1805 0.0792 0.0899 0.0955 0.0989 0.0875 0.1147 0.0837 0.0921 0.1165 0.1193 0.1203 0.0899 0.0993 0.0954 0.1021 0.0578 0.0733 0.0702 0.0854 0.0590 0.0565 0.0737 0.0385 0.0860 0.0714 0.0727 0.0910 0.0888 0.0713 0.1169 0.1037 0.0962
va: 2.3546 2.0739 2.0821 2.1353 2.9881 3.1615 3.8214 4.0099 3.7117 3.8628 3.9284 3.9736 4.0113 3.8913 3.9382 4.0577 3.9353 3.9502 3.8849 3.8552 3.8515 3.8800 4.3071 3.9552 3.9326 3.9046 1.0051 1.0031 1.0091 1.0094 1.0022 1.0036 1.0065 1.0145 1.0054 1.0011 1.0065 1.0094 0.9969 0.9932 1.0204 1.0122 1.0163 1.0146 1.0298 1.0266 1.0104 1.0119 1.0285 1.0058 1.0025 1.0029 1.0043 1.0059 0.9966 1.0079 0.9882 1.0094
dispcorr: -0.033744739 hartree
energy: -1514.935045818134
dipole: -19.67128 19.61849 -0.05278 -7.73282 7.05783 -0.67500 -29.84670 28.93094 -0.91576
magnitude: 1.13887 au
magnitude: 2.89477 debye
