program: Gaussian 09
title: 000065090
version: EM64L-G09RevD.01
frameworkgroup: C1[X(C11H6O4)]
method: RPBEPBE
basis: SDD
operation: Freq
keyword: #pfreq=noraman
keyword: PBEPBE/SDD
title: #p freq=noraman PBEPBE/SDD
converged: NO NO NO NO
title: Mulliken charges:
elementType: O O O O C C C C C C C C C C C H H H H H H
charge: -0.208752 -0.296300 -0.399004 -0.191961 0.321610 0.523026 0.087502 0.033786 -0.653770 0.058025 -0.376496 -0.267967 -0.154856 -0.309133 0.133855 0.260007 0.269693 0.250185 0.268834 0.254760 0.396957
chargesum: 0.00000
title: Mulliken charges with hydrogens summed into heavy atoms:
elementType: O O O O C C C C C C C C C C C
charge: -0.208752 -0.296300 -0.002047 -0.191961 0.321610 0.523026 0.087502 0.033786 -0.393763 0.058025 -0.106803 -0.017782 0.113978 -0.054374 0.133855
polarizability: 2.38238351e+02 -3.68066004e+00 1.34018979e+02 -1.68157967e-02 2.64015541e-06 5.03607509e+01
1716.lowfreq: -8.5642 -0.0004 -0.0003 0.0006 4.2765 4.7834 71.6136 121.9938 166.4396
frequency: 71.6123 121.9935 166.4385 188.5602 199.5698 260.5773 284.1475 358.5833 367.9481 397.0504 410.2019 473.6164 509.9175 539.2272 544.9954 560.1059 583.1839 619.5187 637.9868 699.8006 702.3107 742.6085 756.0287 768.5010 805.2919 822.8782 849.4181 861.2683 884.2396 924.2769 985.9480 989.5444 1029.0461 1064.4004 1102.9090 1118.4264 1172.4843 1203.0679 1237.4027 1248.1189 1274.4521 1339.2921 1396.0983 1423.5102 1453.2730 1463.3538 1530.8519 1592.6582 1608.7086 1651.2225 1692.0349 3137.5859 3157.9881 3189.2135 3226.1358 3269.3877 3506.1064
redmass: 8.6328 5.1522 9.8019 6.1786 7.5057 6.0681 5.1427 8.9268 7.1985 8.6864 3.6648 7.3920 1.1364 6.9506 4.1301 6.5631 3.9306 7.4881 4.3937 7.6023 4.9287 3.0749 6.2115 1.5398 7.2440 1.4774 7.2481 1.3836 1.6148 6.1269 3.3162 1.3293 3.6143 3.6017 3.9349 1.4873 1.6818 1.7231 2.2264 1.4967 1.7856 2.4880 2.7466 6.4475 4.4840 6.8707 5.2349 8.7554 7.5843 7.8873 10.9508 1.0905 1.0929 1.0953 1.0929 1.1075 1.0650
irintensity: 0.3725 3.9061 0.0090 6.0210 3.3886 9.6387 0.7958 0.5404 0.5115 5.3384 0.3726 3.7444 155.9511 5.5848 2.3127 1.4432 0.9986 4.4731 0.2144 57.7522 0.0704 50.2228 7.6195 34.1188 0.0040 5.2169 13.6259 15.1413 70.0215 75.4116 46.4737 0.6585 97.3316 53.2753 58.2064 97.6431 22.5975 6.4039 1.4991 147.8205 12.3462 18.6766 40.9449 69.9161 8.2081 33.5123 9.1501 150.2555 25.2895 23.9876 583.1666 9.0068 3.0526 1.9680 2.7612 0.2400 78.2802
temp: 298.150 k
press: 1.00000 atm
elementType: 8 8 8 8 6 6 6 6 6 6 6 6 6 6 6 1 1 1 1 1 1
symmnumber: 1
zpe: 377870.9 jmol-1
zpe.correction: 0.143923 hartree
zpe.thermalcorrener: 0.154904 hartree
zpe.thermalcorrenthalpy: 0.155849 hartree
zpe.thermalcorrgfe: 0.107235 hartree
zpe.sumelectzpe: -722.618188 hartree
zpe.sumelectthermal: -722.607207 hartree
zpe.sumelectthermalent: -722.606263 hartree
zpe.sumelectthermalfe: -722.654877 hartree
dipole: 3.0768 -4.8936 -0.0080
dipole: 5.7805
quadrupole: -87.8728 -78.9481 -87.7464
quadrupole: 2.7459 0.0376 -0.0203
quadrupole: -3.0170 5.9077 -2.8906 2.7459 0.0376 -0.0203
hfenergy: -722.7621118 hartree
pointgroup: C01 [X(C11H6O4)]
dipole: 1.1950808 1.934901 0.0036967 debye
dipolederiv: -0.9542311 -0.1757957 0.0000232 0.1810193 -0.5140225 -0.0001154 -0.0000182 -0.0002121 -0.1136072 -1.5048863 -0.114044 -0.0015678 0.2193335 -0.3840974 0.0007329 0.0019079 -0.0003294 -0.1938243 -0.1407964 -0.2145269 -0.0000987 -0.083276 -1.317877 -0.0002046 -0.0000369 -0.0001839 -0.3774661 -1.4003376 -0.2685551 0.001802 -0.7291462 -0.6149156 0.0012097 -0.0079767 -0.0022083 -0.3315097 0.1538431 -0.0211106 0.00003 0.3128587 -0.1149114 -0.0001843 0.0001462 0.0000996 0.0698984 -0.5303677 0.067683 0.0003004 0.3928221 -0.0630168 -0.00012 -0.0006982 0.0002974 0.0522539 0.5726136 -0.2226361 -0.0000097 -0.5460174 -0.0441549 0.0001683 -0.0001328 0.0001382 -0.0076072 0.6139856 0.3494741 0.000312 -0.0717506 -0.1297074 -0.0000272 -0.0003073 -0.0005847 0.0216331 0.2372015 -0.051433 -0.0001798 0.0345945 0.0190466 0.0000242 -0.0002177 -0.0002409 -0.2097931 -0.1396794 0.1146475 -0.0001059 0.0986029 1.317444 0.0003012 0.0006977 0.0006421 0.0961888 -0.0259074 0.1774216 0.0000013 0.0375326 -0.0842584 0.0000435 -0.0000755 -0.0000194 -0.2310884 0.9579178 0.0080894 -0.0007095 -0.1813467 0.2623043 -0.0005148 0.0010027 0.000192 -0.0665364 0.1046747 0.1404763 -0.0000109 0.2771101 0.5445815 0.000129 0.0000789 0.000109 -0.1044893 -0.5310046 -0.1278048 0.0007557 -0.6785671 -0.3279828 -0.0003098 0.0002748 0.0006006 -0.1926895 2.1618385 0.2775907 -0.0004271 0.7321492 0.9480184 -0.0016141 0.0049433 0.0008866 0.2868582 0.0735966 0.0098957 0.0000027 -0.0112542 -0.0537177 -0.0000116 0.0000026 0.00007 0.1759747 0.0668468 -0.0354246 0.0000106 -0.0904209 0.0220655 -0.0000305 -0.0000085 -0.0000299 0.1982642 0.0935151 -0.0421599 -0.000085 0.0350403 -0.0736582 0.000336 0.0006007 0.0000549 0.1392355 0.0254548 0.0054434 0.0000411 0.0214667 0.1005232 -0.0000278 0.0000622 -0.000015 0.2162973 -0.0013299 0.0617159 -0.0001366 0.0310929 0.0509944 0.0002181 -0.0002586 0.000655 0.1814319 0.1670524 0.0610529 0.0000518 0.0181562 0.4573424 -0.0000029 0.0000133 0.0000783 0.3905753 unknown
polarizability: 238.172826|4.5135139|134.0844974|0.0213001|0.0223858|50.3607575 unknown
InChI: InChI=1S/C11H6O4/c12-8-2-1-6-5-7-3-4-14-10(7)9(13)11(6)15-8/h1-5,13H
charge 0 multiplicity 1
21 atoms
O  2.983898 -1.120805 -0.000265
O  -1.883219 -1.002868 0.001021
O  0.375629 -2.552853 -0.000274
O  -4.192439 -0.97274 -0.003923
C  1.853257 0.916493 0.000498
C  -0.568708 1.10364 0.00103
C  1.720876 -0.510469 0.00012
C  -0.65283 -0.323534 0.000621
C  0.704323 1.733672 0.000806
C  0.481974 -1.171006 0.000088
C  3.287751 1.174493 0.000263
C  -1.825438 1.824806 0.000421
C  3.918572 -0.048283 -0.000203
C  -3.039926 1.173889 0.000802
C  -3.157731 -0.282922 0.004756
H  0.776266 2.825428 0.000816
H  3.775696 2.146844 0.000414
H  -1.79801 2.920739 -0.001175
H  4.959863 -0.358414 -0.000526
H  -3.987003 1.718861 -0.001302
H  -0.587802 -2.80267 -0.000191
