program: Orca
programVersion: 5.0.2
elementType: S O O O N N C C C C C C C C C C C C C C C C C C C C H H H H H H H H H H H H H H H H H H H H H H H H H H H H H H H H
charge: 0
multiplicity: 1
keywords: wb97x-d3
keywords: def2-TZVPP
keywords: def2/J RIJCOSX
keywords: DEFGRID2
keywords: scfconv7
keywords: smallprint printgap noloewdin
keywords: NOSOSCF
formula: C20H32N2O3S
InChI: InChI=1/C20H32N2O3S/c1-6-8-13-22(14-9-7-2)26-21(5)19(23)24-17-12-10-11-16-15-20(3,4)25-18(16)17/h10-12H,6-9,13-15H2,1-5H3
58 atoms
S  -2.148878 1.478385 1.052544
O  1.989544 -1.480044 -0.254548
O  0.581322 0.703966 1.027212
O  0.318941 -1.228125 2.160117
N  -2.379508 1.607824 -0.575551
N  -1.490381 -0.070895 1.413705
C  2.957755 -2.554758 -0.377138
C  4.328006 -1.842894 -0.298248
C  3.972208 -0.58708 0.440258
C  2.589516 -0.480523 0.411492
C  2.7138 -3.263403 -1.692555
C  2.758636 -3.488143 0.808388
C  4.740729 0.379109 1.056678
C  1.94657 0.569873 1.04309
C  4.10148 1.456459 1.662585
C  2.716561 1.543673 1.661465
C  -3.466926 0.88496 -1.217385
C  -1.260955 1.978587 -1.430755
C  -4.822906 1.105709 -0.566542
C  -0.549392 0.829042 -2.136195
C  -5.944416 0.419834 -1.337689
C  0.697152 1.312606 -2.867603
C  -0.149848 -0.282664 1.590083
C  -7.302919 0.597701 -0.675368
C  1.389704 0.202359 -3.642705
C  -2.37141 -1.122319 1.90012
H  4.724956 -1.616757 -1.293525
H  5.069936 -2.45455 0.217712
H  3.423777 -4.082312 -1.811851
H  2.835023 -2.588113 -2.539869
H  1.709419 -3.685829 -1.73186
H  3.457683 -4.324007 0.753805
H  1.74535 -3.888243 0.820301
H  2.919998 -2.969185 1.753853
H  5.820264 0.301648 1.072198
H  4.682196 2.225687 2.152612
H  2.21681 2.370379 2.149379
H  -3.252563 -0.190506 -1.277622
H  -3.514161 1.242131 -2.251115
H  -0.549362 2.531154 -0.816549
H  -1.635607 2.681607 -2.184686
H  -4.811738 0.736973 0.462319
H  -5.015731 2.18031 -0.501636
H  -0.270417 0.058415 -1.415463
H  -1.226641 0.35248 -2.852821
H  -5.723019 -0.647589 -1.43374
H  -5.981719 0.81197 -2.358484
H  0.432696 2.127372 -3.549521
H  1.395115 1.738672 -2.140945
H  -8.092738 0.107738 -1.244812
H  -7.565462 1.653077 -0.588786
H  -7.311297 0.175283 0.330552
H  2.28427 0.565686 -4.149353
H  0.730866 -0.223877 -4.401288
H  1.689054 -0.604001 -2.972954
H  -2.107583 -2.082031 1.457922
H  -3.389594 -0.876013 1.613101
H  -2.331135 -1.225055 2.985337
totalener: -1514.90021783 hartree
nucrepener: 2753.19132744 hartree
electener: -4268.09154527 hartree
oneelecener: -7544.55227137 hartree
twoeener: 3276.46072610 hartree
kineticenergy: 1509.14024650 hartree
xcener: -129.018085280312 hartree
chargesum: 0.0000000
charge: 0.038950 -0.336481 -0.311761 -0.381586 -0.133212 -0.191023 0.309706 -0.140200 -0.057904 0.264942 -0.277650 -0.293452 -0.168996 0.115713 -0.099612 -0.197907 -0.099805 -0.098963 -0.110344 -0.105980 -0.075545 -0.103940 0.442013 -0.262163 -0.233357 -0.172345 0.077446 0.090189 0.094883 0.087941 0.098729 0.083822 0.093763 0.113006 0.116708 0.119735 0.121249 0.085783 0.080415 0.090763 0.083307 0.054783 0.071365 0.063216 0.067494 0.051995 0.055572 0.061867 0.064245 0.085203 0.075148 0.074246 0.085850 0.073769 0.044942 0.108437 0.091094 0.113934
qa: 0.0390 -0.3365 -0.3118 -0.3816 -0.1332 -0.1910 0.3097 -0.1402 -0.0579 0.2649 -0.2776 -0.2935 -0.1690 0.1157 -0.0996 -0.1979 -0.0998 -0.0990 -0.1103 -0.1060 -0.0755 -0.1039 0.4420 -0.2622 -0.2334 -0.1723 0.0774 0.0902 0.0949 0.0879 0.0987 0.0838 0.0938 0.1130 0.1167 0.1197 0.1212 0.0858 0.0804 0.0908 0.0833 0.0548 0.0714 0.0632 0.0675 0.0520 0.0556 0.0619 0.0642 0.0852 0.0751 0.0742 0.0858 0.0738 0.0449 0.1084 0.0911 0.1139
va: 2.3641 2.0777 2.0816 2.1370 3.0353 3.1280 3.8648 3.9706 3.6893 3.8902 3.9083 3.9657 4.0184 3.8721 3.9217 4.0590 3.9135 3.9245 3.8908 3.7704 3.8756 3.9041 4.2678 3.9624 3.9368 3.9281 1.0074 1.0037 1.0063 1.0039 1.0104 1.0073 1.0167 1.0060 1.0061 1.0010 1.0085 0.9860 0.9944 1.0169 0.9994 1.0284 1.0202 1.0351 1.0127 1.0097 1.0081 1.0111 1.0087 1.0057 1.0025 1.0028 1.0069 1.0076 1.0196 0.9971 0.9955 0.9969
dispcorr: -0.032459492 hartree
energy: -1514.932677319213
dipole: -17.57035 17.63280 0.06245 -8.99365 8.62313 -0.37052 -24.01004 23.06427 -0.94577
magnitude: 1.01768 au
magnitude: 2.58673 debye
