program: Orca
programVersion: 5.0.2
elementType: S O O O N N C C C C C C C C C C C C C C C C C C C C H H H H H H H H H H H H H H H H H H H H H H H H H H H H H H H H
charge: 0
multiplicity: 1
keywords: wb97x-d3
keywords: def2-TZVPP
keywords: def2/J RIJCOSX
keywords: DEFGRID2
keywords: scfconv7
keywords: smallprint printgap noloewdin
keywords: NOSOSCF
formula: C20H32N2O3S
InChI: InChI=1/C20H32N2O3S/c1-6-8-13-22(14-9-7-2)26-21(5)19(23)24-17-12-10-11-16-15-20(3,4)25-18(16)17/h10-12H,6-9,13-15H2,1-5H3
58 atoms
S  -1.538028 1.64513 0.81077
O  1.135845 -1.905461 -0.044967
O  0.829657 0.322294 1.623278
O  2.224881 2.086655 1.454247
N  -1.669698 1.492119 -0.834741
N  -0.008973 2.351882 1.141545
C  1.701825 -2.99039 -0.820939
C  2.71634 -3.67456 0.127255
C  2.927768 -2.624505 1.175867
C  1.95105 -1.658552 0.994631
C  2.402062 -2.372694 -2.022089
C  0.563801 -3.900326 -1.238792
C  3.836958 -2.512933 2.207967
C  1.856983 -0.562282 1.833581
C  3.745815 -1.417608 3.061081
C  2.764859 -0.453008 2.878489
C  -0.893285 0.459585 -1.513489
C  -1.96106 2.667993 -1.643271
C  -1.763714 -0.548741 -2.249445
C  -3.168626 3.466355 -1.177806
C  -2.653146 -1.350676 -1.310009
C  -4.466885 2.670861 -1.087859
C  1.120317 1.620481 1.399427
C  -3.450765 -2.429199 -2.026523
C  -4.912108 2.05522 -2.407106
C  0.171798 3.788227 0.998987
H  3.631457 -3.952367 -0.398888
H  2.30504 -4.589349 0.565439
H  1.702679 -1.79217 -2.62523
H  2.83005 -3.149652 -2.656968
H  3.211267 -1.710404 -1.709919
H  0.946724 -4.739892 -1.81986
H  -0.161962 -3.370189 -1.857396
H  0.040681 -4.300162 -0.369946
H  4.603878 -3.262039 2.356809
H  4.446903 -1.307563 3.87671
H  2.710415 0.391756 3.550365
H  -0.293213 -0.075227 -0.781834
H  -0.186931 0.930845 -2.207616
H  -2.140307 2.313124 -2.661873
H  -1.085412 3.328868 -1.707631
H  -2.37332 -0.05269 -3.012821
H  -1.098237 -1.226481 -2.796194
H  -2.959455 3.922956 -0.207827
H  -3.296573 4.295996 -1.880482
H  -3.334018 -0.670679 -0.792437
H  -2.02981 -1.803613 -0.533126
H  -4.367504 1.886973 -0.333839
H  -5.250583 3.339216 -0.722578
H  -4.084299 -2.983623 -1.334044
H  -2.7949 -3.150375 -2.518795
H  -4.09911 -2.002087 -2.79381
H  -4.225634 1.279109 -2.747752
H  -4.979669 2.806805 -3.196379
H  -5.894059 1.591656 -2.31189
H  -0.806304 4.259889 1.042372
H  0.646921 4.050805 0.052335
H  0.784718 4.185459 1.80641
totalener: -1514.89824203 hartree
nucrepener: 2767.92733027 hartree
electener: -4282.82557230 hartree
oneelecener: -7573.72441884 hartree
twoeener: 3290.89884653 hartree
kineticenergy: 1509.14874534 hartree
xcener: -129.022399548482 hartree
chargesum: -0.0000000
charge: 0.051475 -0.323679 -0.302252 -0.381711 -0.137061 -0.168958 0.316711 -0.138875 -0.078333 0.262341 -0.299471 -0.274369 -0.170228 0.073085 -0.119816 -0.099377 -0.071835 -0.168627 -0.157639 -0.130069 -0.103161 -0.095202 0.419493 -0.251771 -0.260005 -0.187280 0.088162 0.082319 0.087227 0.090449 0.111229 0.098769 0.071474 0.097915 0.116468 0.119319 0.106304 0.075216 0.100175 0.102460 0.101474 0.072139 0.066431 0.075985 0.073842 0.064315 0.075732 0.059196 0.070716 0.087262 0.066801 0.075663 0.067113 0.080900 0.089950 0.099878 0.105935 0.115796
qa: 0.0515 -0.3237 -0.3023 -0.3817 -0.1371 -0.1690 0.3167 -0.1389 -0.0783 0.2623 -0.2995 -0.2744 -0.1702 0.0731 -0.1198 -0.0994 -0.0718 -0.1686 -0.1576 -0.1301 -0.1032 -0.0952 0.4195 -0.2518 -0.2600 -0.1873 0.0882 0.0823 0.0872 0.0904 0.1112 0.0988 0.0715 0.0979 0.1165 0.1193 0.1063 0.0752 0.1002 0.1025 0.1015 0.0721 0.0664 0.0760 0.0738 0.0643 0.0757 0.0592 0.0707 0.0873 0.0668 0.0757 0.0671 0.0809 0.0899 0.0999 0.1059 0.1158
va: 2.3726 2.0938 2.1208 2.1372 2.9659 3.1737 3.7881 3.9861 3.7054 3.9330 3.9831 3.9350 4.0259 3.9853 3.9368 3.9979 3.9043 3.9405 3.8800 3.8793 3.8388 3.8768 4.3006 3.9494 3.9289 3.9126 1.0033 1.0052 1.0097 1.0079 1.0007 1.0093 1.0158 1.0082 1.0055 1.0020 1.0148 1.0452 1.0002 0.9886 0.9987 1.0145 1.0185 1.0265 1.0159 1.0214 1.0156 1.0197 1.0124 1.0060 1.0018 1.0016 1.0041 1.0058 1.0076 1.0007 0.9920 1.0066
dispcorr: -0.034014876 hartree
energy: -1514.932256905491
dipole: -25.50522 25.34437 -0.16086 -4.57793 3.96979 -0.60814 -29.90835 28.96021 -0.94814
magnitude: 1.13784 au
magnitude: 2.89215 debye
