program: Orca
programVersion: 5.0.2
elementType: S O O O N N C C C C C C C C C C C C C C C C C C C C H H H H H H H H H H H H H H H H H H H H H H H H H H H H H H H H
charge: 0
multiplicity: 1
keywords: wb97x-d3
keywords: def2-TZVPP
keywords: def2/J RIJCOSX
keywords: DEFGRID2
keywords: scfconv7
keywords: smallprint printgap noloewdin
keywords: NOSOSCF
formula: C20H32N2O3S
InChI: InChI=1/C20H32N2O3S/c1-6-8-13-22(14-9-7-2)26-21(5)19(23)24-17-12-10-11-16-15-20(3,4)25-18(16)17/h10-12H,6-9,13-15H2,1-5H3
58 atoms
S  -1.052577 2.417266 0.261091
O  1.330202 -1.742306 -0.337439
O  0.4014 0.293022 1.446868
O  2.455501 0.891094 0.740587
N  -1.726355 1.622702 -1.036146
N  0.644768 2.161347 0.221331
C  2.113568 -2.836918 -0.878201
C  2.075405 -3.926789 0.219149
C  1.717661 -3.12842 1.436654
C  1.296316 -1.885633 0.996295
C  3.528908 -2.318977 -1.088306
C  1.467109 -3.268453 -2.17824
C  1.700073 -3.436424 2.782834
C  0.869946 -0.917462 1.886869
C  1.257021 -2.473551 3.683852
C  0.849717 -1.222654 3.237878
C  -1.935228 0.179528 -0.927635
C  -1.386572 2.101269 -2.370263
C  -2.789252 -0.205184 0.271322
C  -1.681715 3.576168 -2.593182
C  -3.256455 -1.658501 0.23093
C  -3.13782 3.952006 -2.357218
C  1.273989 1.090594 0.793808
C  -2.143308 -2.687942 0.377755
C  -3.416991 5.415056 -2.669074
C  1.50081 3.105953 -0.4812
H  3.032817 -4.44392 0.303169
H  1.313508 -4.684898 0.010226
H  3.968567 -1.981275 -0.148996
H  3.536329 -1.476671 -1.779796
H  4.165447 -3.103523 -1.499874
H  2.023555 -4.096948 -2.617399
H  1.45499 -2.453516 -2.902689
H  0.440409 -3.599431 -2.017748
H  2.020384 -4.409137 3.133333
H  1.236002 -2.69209 4.742525
H  0.512729 -0.471335 3.939978
H  -0.98433 -0.364604 -0.933401
H  -2.466775 -0.121437 -1.835814
H  -1.98747 1.520812 -3.076272
H  -0.337263 1.886403 -2.617023
H  -2.244081 -0.022553 1.198709
H  -3.662639 0.45232 0.287237
H  -1.037332 4.195938 -1.964528
H  -1.403725 3.807795 -3.626302
H  -3.804426 -1.839629 -0.699509
H  -3.981469 -1.807429 1.034881
H  -3.78032 3.315031 -2.973073
H  -3.40773 3.738249 -1.321286
H  -1.418646 -2.631266 -0.435281
H  -2.547792 -3.700817 0.383044
H  -1.595262 -2.547921 1.310737
H  -2.812318 6.074227 -2.04395
H  -4.462734 5.668451 -2.494814
H  -3.190222 5.652913 -3.70984
H  0.920056 3.996914 -0.70133
H  1.877567 2.692832 -1.418232
H  2.354327 3.39103 0.13195
totalener: -1514.90077757 hartree
nucrepener: 2800.83439539 hartree
electener: -4315.73517296 hartree
oneelecener: -7639.81442291 hartree
twoeener: 3324.07924994 hartree
kineticenergy: 1509.14681287 hartree
xcener: -129.020523710060 hartree
chargesum: 0.0000000
charge: 0.035737 -0.326406 -0.310241 -0.378915 -0.113288 -0.177005 0.318523 -0.160289 -0.058686 0.286652 -0.291121 -0.282309 -0.140396 0.064244 -0.115497 -0.170523 -0.135501 -0.135382 -0.098448 -0.127797 -0.106522 -0.054390 0.429011 -0.237249 -0.260057 -0.181276 0.091227 0.079790 0.114741 0.092403 0.083287 0.095348 0.094943 0.089687 0.116007 0.119476 0.119666 0.081961 0.078688 0.086932 0.102800 0.079988 0.080897 0.066124 0.068250 0.048157 0.067454 0.049934 0.058446 0.047640 0.089958 0.074379 0.075411 0.084659 0.069794 0.098637 0.102720 0.117723
qa: 0.0357 -0.3264 -0.3102 -0.3789 -0.1133 -0.1770 0.3185 -0.1603 -0.0587 0.2867 -0.2911 -0.2823 -0.1404 0.0642 -0.1155 -0.1705 -0.1355 -0.1354 -0.0984 -0.1278 -0.1065 -0.0544 0.4290 -0.2372 -0.2601 -0.1813 0.0912 0.0798 0.1147 0.0924 0.0833 0.0953 0.0949 0.0897 0.1160 0.1195 0.1197 0.0820 0.0787 0.0869 0.1028 0.0800 0.0809 0.0661 0.0683 0.0482 0.0675 0.0499 0.0584 0.0476 0.0900 0.0744 0.0754 0.0847 0.0698 0.0986 0.1027 0.1177
va: 2.3544 2.0739 2.0725 2.1379 3.0081 3.1595 3.8436 4.0092 3.7027 3.8248 3.9693 3.9266 4.0142 3.8497 3.9340 4.0484 3.9422 3.9461 3.8391 3.8695 3.9256 3.8466 4.3016 3.9442 3.9536 3.9061 1.0032 1.0066 1.0038 1.0148 1.0068 1.0069 1.0101 1.0025 1.0049 1.0012 1.0075 1.0038 1.0043 1.0001 0.9964 1.0234 1.0196 1.0184 1.0171 1.0091 1.0076 1.0115 1.0268 1.0112 1.0074 1.0060 1.0026 1.0060 1.0026 1.0030 0.9908 1.0058
dispcorr: -0.034233712 hartree
energy: -1514.935011283166
dipole: -15.21777 15.07645 -0.14132 0.29780 -1.05672 -0.75892 -23.33539 22.46138 -0.87401
magnitude: 1.16611 au
magnitude: 2.96403 debye
