program: Orca
programVersion: 5.0.2
elementType: S O O O N N C C C C C C C C C C C C C C C C C C C C H H H H H H H H H H H H H H H H H H H H H H H H H H H H H H H H
charge: 0
multiplicity: 1
keywords: wb97x-d3
keywords: def2-TZVPP
keywords: def2/J RIJCOSX
keywords: DEFGRID2
keywords: scfconv7
keywords: smallprint printgap noloewdin
keywords: NOSOSCF
formula: C20H32N2O3S
InChI: InChI=1/C20H32N2O3S/c1-6-8-13-22(14-9-7-2)26-21(5)19(23)24-17-12-10-11-16-15-20(3,4)25-18(16)17/h10-12H,6-9,13-15H2,1-5H3
58 atoms
S  -1.991576 1.544825 1.042264
O  1.550567 -1.470232 -0.029033
O  0.729857 0.893093 1.357405
O  0.479937 -0.842567 2.771898
N  -2.469098 0.76772 -0.343716
N  -1.325055 0.367208 2.096981
C  2.314793 -2.651524 -0.380086
C  3.759604 -2.135242 -0.580015
C  3.738163 -0.851248 0.195416
C  2.409852 -0.559346 0.454763
C  1.70187 -3.239177 -1.633884
C  2.235741 -3.611788 0.797386
C  4.735193 0.009666 0.610554
C  2.047168 0.580889 1.14734
C  4.378231 1.166801 1.295801
C  3.044795 1.44651 1.565595
C  -3.699309 -0.013093 -0.317736
C  -1.436127 0.289446 -1.256674
C  -4.568785 0.213602 -1.55043
C  -0.566574 1.401195 -1.818679
C  -4.981145 1.667445 -1.738859
C  0.50013 0.869402 -2.767596
C  0.006294 0.049778 2.125301
C  -5.871977 1.872667 -2.955381
C  1.437687 1.961888 -3.260492
C  -2.209136 -0.451928 2.909476
H  3.98021 -1.951819 -1.636635
H  4.495966 -2.853137 -0.214937
H  2.260924 -4.121444 -1.946906
H  1.716073 -2.521078 -2.454403
H  0.668701 -3.542672 -1.462402
H  2.664152 -3.16869 1.69739
H  2.781696 -4.530197 0.576827
H  1.200994 -3.873825 1.016962
H  5.77611 -0.20648 0.407196
H  5.142691 1.853644 1.631812
H  2.769037 2.34306 2.1052
H  -4.263017 0.286057 0.567548
H  -3.481031 -1.083931 -0.205279
H  -1.942227 -0.212363 -2.085435
H  -0.812651 -0.475408 -0.778306
H  -4.060987 -0.145189 -2.451565
H  -5.459522 -0.414709 -1.44718
H  -1.203891 2.123541 -2.33804
H  -0.086088 1.942878 -1.001691
H  -4.086583 2.287407 -1.827319
H  -5.499911 2.015454 -0.840178
H  1.080473 0.094754 -2.258933
H  0.023102 0.380598 -3.62327
H  -6.151924 2.919892 -3.071048
H  -6.793887 1.293237 -2.880546
H  -5.366977 1.566168 -3.873176
H  1.97191 2.422306 -2.428343
H  0.890687 2.751441 -3.778443
H  2.182873 1.569656 -3.952923
H  -2.4002 -1.423965 2.45114
H  -3.154146 0.07309 3.021162
H  -1.784124 -0.619262 3.897188
totalener: -1514.90257371 hartree
nucrepener: 2782.97369556 hartree
electener: -4297.87626927 hartree
oneelecener: -7604.04050639 hartree
twoeener: 3306.16423712 hartree
kineticenergy: 1509.15172830 hartree
xcener: -129.019240050018 hartree
chargesum: 0.0000000
charge: 0.041009 -0.330293 -0.310042 -0.378222 -0.125768 -0.172511 0.314754 -0.153125 -0.062063 0.293743 -0.282447 -0.290816 -0.150882 0.089768 -0.111766 -0.184811 -0.116447 -0.156062 -0.118403 -0.105083 -0.076279 -0.067737 0.419233 -0.259907 -0.259425 -0.180868 0.078702 0.090228 0.096680 0.089563 0.094277 0.114546 0.083821 0.092688 0.116675 0.119201 0.121272 0.089105 0.098441 0.093680 0.098690 0.057497 0.072713 0.072348 0.074837 0.059201 0.055526 0.019936 0.062594 0.085974 0.071092 0.072794 0.080981 0.074314 0.079826 0.104752 0.095972 0.116523
qa: 0.0410 -0.3303 -0.3100 -0.3782 -0.1258 -0.1725 0.3148 -0.1531 -0.0621 0.2937 -0.2824 -0.2908 -0.1509 0.0898 -0.1118 -0.1848 -0.1164 -0.1561 -0.1184 -0.1051 -0.0763 -0.0677 0.4192 -0.2599 -0.2594 -0.1809 0.0787 0.0902 0.0967 0.0896 0.0943 0.1145 0.0838 0.0927 0.1167 0.1192 0.1213 0.0891 0.0984 0.0937 0.0987 0.0575 0.0727 0.0723 0.0748 0.0592 0.0555 0.0199 0.0626 0.0860 0.0711 0.0728 0.0810 0.0743 0.0798 0.1048 0.0960 0.1165
va: 2.3514 2.0703 2.0751 2.1361 2.9783 3.1603 3.8435 3.9986 3.7069 3.8323 3.9253 3.9712 4.0122 3.8715 3.9362 4.0551 3.9344 3.9434 3.8845 3.8535 3.8516 3.8899 4.3098 3.9556 3.9623 3.9040 1.0059 1.0032 1.0072 1.0041 1.0096 1.0038 1.0066 1.0154 1.0052 1.0011 1.0067 1.0091 0.9979 0.9995 1.0216 1.0132 1.0163 1.0163 1.0253 1.0264 1.0103 1.0232 1.0065 1.0058 1.0025 1.0027 1.0033 1.0033 1.0061 0.9880 1.0096 1.0075
dispcorr: -0.033248570 hartree
energy: -1514.935822277293
dipole: -17.23058 17.15937 -0.07122 -6.03287 5.25370 -0.77916 -27.98586 27.12013 -0.86573
magnitude: 1.16690 au
magnitude: 2.96602 debye
