program: Orca
programVersion: 5.0.2
elementType: S O O O N N C C C C C C C C C C C C C C C C C C C C H H H H H H H H H H H H H H H H H H H H H H H H H H H H H H H H
charge: 0
multiplicity: 1
keywords: wb97x-d3
keywords: def2-TZVPP
keywords: def2/J RIJCOSX
keywords: DEFGRID2
keywords: scfconv7
keywords: smallprint printgap noloewdin
keywords: NOSOSCF
formula: C20H32N2O3S
InChI: InChI=1/C20H32N2O3S/c1-6-8-13-22(14-9-7-2)26-21(5)19(23)24-17-12-10-11-16-15-20(3,4)25-18(16)17/h10-12H,6-9,13-15H2,1-5H3
58 atoms
S  -1.3947 1.638728 0.612603
O  1.865558 -1.655601 1.876808
O  0.21972 -0.547771 -0.175099
O  2.185525 0.54839 -0.282008
N  -2.237702 1.998154 -0.781412
N  0.274054 1.66658 0.222393
C  2.9643 -2.347916 2.522159
C  2.978184 -3.753769 1.874516
C  2.236672 -3.510079 0.594296
C  1.625517 -2.272786 0.712574
C  2.684818 -2.372813 4.010444
C  4.237507 -1.58209 2.194573
C  2.062435 -4.270568 -0.545296
C  0.851632 -1.757282 -0.311094
C  1.270323 -3.766679 -1.571759
C  0.674731 -2.517151 -1.455406
C  -2.315486 0.960402 -1.805258
C  -2.120971 3.358347 -1.294979
C  -2.93993 -0.334463 -1.3148
C  -2.584482 4.422287 -0.313735
C  -3.047918 -1.36555 -2.431891
C  -2.477232 5.824218 -0.901694
C  1.001383 0.549904 -0.091828
C  -3.553581 -2.712736 -1.938437
C  -2.968435 6.899349 0.056428
C  1.030764 2.906532 0.333526
H  2.458361 -4.490467 2.495651
H  3.996829 -4.116282 1.726134
H  1.744935 -2.881008 4.227197
H  2.628844 -1.363124 4.418213
H  3.482963 -2.900109 4.53378
H  4.410686 -1.547606 1.118037
H  5.100276 -2.057309 2.663704
H  4.176232 -0.55521 2.554354
H  2.532357 -5.240914 -0.641851
H  1.12266 -4.343424 -2.474313
H  0.068324 -2.122218 -2.260342
H  -1.330601 0.758818 -2.249489
H  -2.934757 1.361369 -2.612831
H  -2.751227 3.416822 -2.186742
H  -1.097988 3.574715 -1.636564
H  -2.351007 -0.748512 -0.49556
H  -3.932455 -0.119019 -0.908906
H  -3.619695 4.211958 -0.030756
H  -2.001139 4.370311 0.609053
H  -2.067583 -1.499764 -2.90006
H  -3.706322 -0.990397 -3.221497
H  -1.437429 6.026583 -1.176244
H  -3.049359 5.878513 -1.832911
H  -4.538976 -2.622437 -1.47875
H  -2.879145 -3.133845 -1.191501
H  -3.634967 -3.432514 -2.753176
H  -2.393969 6.895309 0.984027
H  -4.015501 6.744251 0.320342
H  -2.882762 7.894642 -0.379565
H  1.849638 2.809693 1.045857
H  0.359737 3.686673 0.680956
H  1.449611 3.206337 -0.627462
totalener: -1514.90084753 hartree
nucrepener: 2696.32895949 hartree
electener: -4211.22980702 hartree
oneelecener: -7430.75801525 hartree
twoeener: 3219.52820823 hartree
kineticenergy: 1509.14576863 hartree
xcener: -129.015940045334 hartree
chargesum: -0.0000000
charge: 0.044728 -0.327789 -0.314110 -0.379139 -0.104054 -0.182497 0.329049 -0.144774 -0.080046 0.264060 -0.270162 -0.296506 -0.161147 0.130981 -0.135516 -0.169418 -0.126855 -0.138144 -0.107080 -0.094781 -0.118316 -0.079553 0.430577 -0.256464 -0.259325 -0.179679 0.080337 0.088012 0.088700 0.094364 0.084828 0.114297 0.082613 0.092587 0.116696 0.117569 0.122335 0.080455 0.083630 0.085401 0.084620 0.077898 0.076015 0.070138 0.057800 0.053149 0.068898 0.053123 0.055408 0.076383 0.080938 0.082653 0.074647 0.074761 0.085086 0.117362 0.096078 0.109173
qa: 0.0447 -0.3278 -0.3141 -0.3791 -0.1041 -0.1825 0.3290 -0.1448 -0.0800 0.2641 -0.2702 -0.2965 -0.1611 0.1310 -0.1355 -0.1694 -0.1269 -0.1381 -0.1071 -0.0948 -0.1183 -0.0796 0.4306 -0.2565 -0.2593 -0.1797 0.0803 0.0880 0.0887 0.0944 0.0848 0.1143 0.0826 0.0926 0.1167 0.1176 0.1223 0.0805 0.0836 0.0854 0.0846 0.0779 0.0760 0.0701 0.0578 0.0531 0.0689 0.0531 0.0554 0.0764 0.0809 0.0827 0.0746 0.0748 0.0851 0.1174 0.0961 0.1092
va: 2.3378 2.1335 2.0928 2.1407 3.0290 3.1432 3.8067 3.9834 3.6928 3.9363 3.9356 3.9716 4.0166 3.8817 3.9681 4.0130 3.9456 3.9549 3.8188 3.8281 3.8942 3.8778 4.2984 3.9499 3.9602 3.9062 1.0064 1.0027 1.0106 1.0103 1.0049 1.0039 1.0069 1.0146 1.0065 1.0033 1.0008 1.0017 1.0024 1.0033 0.9914 1.0269 1.0217 1.0220 1.0326 1.0075 1.0089 1.0085 1.0075 1.0028 1.0043 1.0055 1.0028 1.0027 1.0057 1.0032 0.9978 0.9929
dispcorr: -0.030299359 hartree
energy: -1514.931146887045
dipole: -14.21499 14.15355 -0.06145 15.40000 -15.38922 0.01078 -4.29537 4.29736 0.00200
magnitude: 0.06242 au
magnitude: 0.15866 debye
