program: Orca
programVersion: 5.0.2
elementType: S O O O N N C C C C C C C C C C C C C C C C C C C C H H H H H H H H H H H H H H H H H H H H H H H H H H H H H H H H
charge: 0
multiplicity: 1
keywords: wb97x-d3
keywords: def2-TZVPP
keywords: def2/J RIJCOSX
keywords: DEFGRID2
keywords: scfconv7
keywords: smallprint printgap noloewdin
keywords: NOSOSCF
formula: C20H32N2O3S
InChI: InChI=1/C20H32N2O3S/c1-6-8-13-22(14-9-7-2)26-21(5)19(23)24-17-12-10-11-16-15-20(3,4)25-18(16)17/h10-12H,6-9,13-15H2,1-5H3
58 atoms
S  -1.634378 2.247828 0.866175
O  0.900055 -1.34934 -0.117074
O  0.785583 0.947771 1.535603
O  -0.098311 -0.636612 2.869749
N  -1.832565 1.483756 -0.586509
N  -1.40784 1.022843 2.037009
C  1.226539 -2.677548 -0.60104
C  2.772786 -2.748577 -0.552056
C  3.106939 -1.643263 0.403581
C  1.956188 -0.895374 0.576231
C  0.666592 -2.806538 -2.002685
C  0.59713 -3.67449 0.360059
C  4.275582 -1.279133 1.0440
C  1.934561 0.212177 1.402982
C  4.267414 -0.155845 1.864668
C  3.103375 0.580552 2.047232
C  -3.157794 1.173448 -1.097157
C  -0.728995 1.482781 -1.533691
C  -3.324281 -0.272122 -1.556156
C  -0.64248 2.74723 -2.380563
C  -3.058785 -1.305799 -0.471985
C  0.49607 2.689067 -3.390608
C  -0.229804 0.349689 2.200628
C  -3.308911 -2.729269 -0.948917
C  0.61171 3.956547 -4.224503
C  -2.552001 0.504113 2.771304
H  3.21603 -2.565077 -1.536102
H  3.11741 -3.72933 -0.219519
H  -0.417279 -2.686566 -2.006965
H  0.894578 -3.791839 -2.410187
H  1.096234 -2.057287 -2.668383
H  0.807909 -4.696964 0.043131
H  -0.485301 -3.546993 0.397346
H  0.983804 -3.544499 1.371886
H  5.182647 -1.85486 0.912473
H  5.170416 0.144376 2.377927
H  3.095856 1.44529 2.697601
H  -3.413932 1.841172 -1.929814
H  -3.875851 1.384637 -0.303194
H  -0.823674 0.605826 -2.181695
H  0.201402 1.344307 -0.986253
H  -4.348077 -0.380807 -1.929337
H  -2.679467 -0.471878 -2.41818
H  -1.587672 2.914206 -2.907635
H  -0.50259 3.607536 -1.718261
H  -3.703369 -1.097905 0.387615
H  -2.031297 -1.207405 -0.113185
H  1.438522 2.510707 -2.864091
H  0.353749 1.828073 -4.051323
H  -4.346367 -2.871461 -1.256406
H  -3.096112 -3.456715 -0.164892
H  -2.681591 -2.979458 -1.806682
H  1.435466 3.894981 -4.935934
H  0.786548 4.829217 -3.593548
H  -0.301229 4.141478 -4.792803
H  -3.376645 1.201061 2.65058
H  -2.322003 0.418696 3.83213
H  -2.861962 -0.476432 2.409773
totalener: -1514.89872212 hartree
nucrepener: 2819.45277377 hartree
electener: -4334.35149590 hartree
oneelecener: -7676.92881063 hartree
twoeener: 3342.57731473 hartree
kineticenergy: 1509.15162320 hartree
xcener: -129.022954779442 hartree
chargesum: 0.0000000
charge: 0.040019 -0.326865 -0.323323 -0.375675 -0.162362 -0.144462 0.318318 -0.146041 -0.092744 0.288806 -0.280899 -0.294269 -0.159380 0.128643 -0.108644 -0.182482 -0.102721 -0.078427 -0.096816 -0.091203 -0.069032 -0.089292 0.413869 -0.301889 -0.254459 -0.185363 0.080075 0.088106 0.076267 0.099060 0.090487 0.086640 0.088321 0.118730 0.116546 0.118809 0.118366 0.087854 0.085101 0.072798 0.091067 0.073007 0.058440 0.051499 0.060012 0.058229 0.038458 0.059483 0.050555 0.090782 0.092697 0.078544 0.084477 0.075590 0.071257 0.094864 0.117886 0.102683
qa: 0.0400 -0.3269 -0.3233 -0.3757 -0.1624 -0.1445 0.3183 -0.1460 -0.0927 0.2888 -0.2809 -0.2943 -0.1594 0.1286 -0.1086 -0.1825 -0.1027 -0.0784 -0.0968 -0.0912 -0.0690 -0.0893 0.4139 -0.3019 -0.2545 -0.1854 0.0801 0.0881 0.0763 0.0991 0.0905 0.0866 0.0883 0.1187 0.1165 0.1188 0.1184 0.0879 0.0851 0.0728 0.0911 0.0730 0.0584 0.0515 0.0600 0.0582 0.0385 0.0595 0.0506 0.0908 0.0927 0.0785 0.0845 0.0756 0.0713 0.0949 0.1179 0.1027
va: 2.3785 2.0994 2.0799 2.1361 3.0127 3.1454 3.8185 3.9932 3.7330 3.9231 3.9327 3.9865 4.0119 3.8430 3.9345 4.0767 3.9445 3.9620 3.7924 3.9039 3.8408 3.9010 4.3170 3.9639 3.9550 3.9146 1.0043 1.0035 1.0159 1.0094 1.0108 1.0071 1.0105 1.0036 1.0057 1.0011 1.0069 0.9985 1.0161 0.9982 1.0178 1.0170 1.0053 1.0163 1.0200 1.0111 1.0242 1.0081 1.0076 1.0064 1.0027 0.9961 1.0056 1.0035 1.0033 1.0109 1.0031 0.9886
dispcorr: -0.034503076 hartree
energy: -1514.933225199760
dipole: -14.77158 14.62409 -0.14748 -9.04860 8.49131 -0.55729 -28.90539 27.73211 -1.17328
magnitude: 1.30725 au
magnitude: 3.32277 debye
