program: Orca
programVersion: 5.0.2
elementType: S O O O N N C C C C C C C C C C C C C C C C C C C C H H H H H H H H H H H H H H H H H H H H H H H H H H H H H H H H
charge: 0
multiplicity: 1
keywords: wb97x-d3
keywords: def2-TZVPP
keywords: def2/J RIJCOSX
keywords: DEFGRID2
keywords: scfconv7
keywords: smallprint printgap noloewdin
keywords: NOSOSCF
formula: C20H32N2O3S
InChI: InChI=1/C20H32N2O3S/c1-6-8-13-22(14-9-7-2)26-21(5)19(23)24-17-12-10-11-16-15-20(3,4)25-18(16)17/h10-12H,6-9,13-15H2,1-5H3
58 atoms
S  -1.939972 2.2920 0.830106
O  0.882163 -1.401075 -0.261234
O  0.560833 1.034105 1.168639
O  -0.050624 -0.501507 2.699181
N  -2.239754 1.734962 -0.688866
N  -1.571655 0.970745 1.870617
C  1.369067 -2.700758 -0.686429
C  2.910045 -2.55198 -0.74065
C  3.139656 -1.328454 0.093748
C  1.905202 -0.74093 0.304191
C  0.754193 -3.003841 -2.037216
C  0.94602 -3.708443 0.371271
C  4.286118 -0.739323 0.590785
C  1.783232 0.433706 1.022545
C  4.17343 0.44763 1.3072
C  2.929384 1.02649 1.524717
C  -3.544391 1.210837 -1.062603
C  -1.159475 1.5437 -1.650864
C  -3.580835 -0.266307 -1.44626
C  -0.195142 2.717171 -1.742604
C  -3.139386 -1.233817 -0.35925
C  0.832145 2.547109 -2.860649
C  -0.329449 0.415068 1.976754
C  -3.251157 -2.686154 -0.799525
C  1.834786 1.423033 -2.627776
C  -2.594008 0.425615 2.750488
H  3.265183 -2.400487 -1.765106
H  3.410781 -3.441368 -0.353534
H  -0.333246 -3.055016 -1.974485
H  1.111356 -3.965545 -2.406557
H  1.020543 -2.241362 -2.770351
H  1.275117 -4.711619 0.096852
H  -0.138921 -3.724146 0.479585
H  1.375964 -3.4632 1.343371
H  5.256765 -1.188398 0.424534
H  5.057859 0.923876 1.707188
H  2.841142 1.946718 2.087169
H  -3.922519 1.793985 -1.911596
H  -4.225457 1.394743 -0.230174
H  -1.635447 1.425387 -2.630031
H  -0.622107 0.610536 -1.455561
H  -4.609375 -0.495697 -1.744554
H  -2.975435 -0.430909 -2.343203
H  -0.776707 3.626593 -1.918174
H  0.321813 2.85712 -0.791964
H  -3.749459 -1.078613 0.535008
H  -2.10766 -1.02324 -0.068689
H  0.316107 2.390413 -3.813611
H  1.377724 3.487491 -2.97215
H  -4.279187 -2.951764 -1.051158
H  -2.916713 -3.367035 -0.016275
H  -2.641051 -2.877683 -1.684124
H  2.564169 1.376188 -3.437284
H  1.354571 0.445784 -2.566204
H  2.384784 1.570512 -1.697067
H  -3.531809 0.929209 2.53574
H  -2.343506 0.59085 3.798427
H  -2.725665 -0.64465 2.598243
totalener: -1514.89856439 hartree
nucrepener: 2880.18922882 hartree
electener: -4395.08779321 hartree
oneelecener: -7798.48885776 hartree
twoeener: 3403.40106455 hartree
kineticenergy: 1509.13854748 hartree
xcener: -129.023921897219 hartree
chargesum: 0.0000000
charge: 0.034583 -0.323751 -0.311963 -0.376762 -0.123151 -0.169960 0.311575 -0.155269 -0.066396 0.303356 -0.284948 -0.289531 -0.142085 0.053385 -0.113324 -0.166040 -0.126904 -0.108490 -0.077360 -0.109269 -0.063734 -0.101643 0.413402 -0.299512 -0.238032 -0.182177 0.081331 0.090501 0.089512 0.099527 0.091655 0.085284 0.090067 0.116711 0.117022 0.118839 0.118005 0.091754 0.084833 0.081564 0.068573 0.073182 0.060079 0.080721 0.079313 0.054430 0.037609 0.047356 0.068684 0.090868 0.092370 0.075950 0.090380 0.043349 0.077952 0.094574 0.119860 0.102142
qa: 0.0346 -0.3238 -0.3120 -0.3768 -0.1232 -0.1700 0.3116 -0.1553 -0.0664 0.3034 -0.2849 -0.2895 -0.1421 0.0534 -0.1133 -0.1660 -0.1269 -0.1085 -0.0774 -0.1093 -0.0637 -0.1016 0.4134 -0.2995 -0.2380 -0.1822 0.0813 0.0905 0.0895 0.0995 0.0917 0.0853 0.0901 0.1167 0.1170 0.1188 0.1180 0.0918 0.0848 0.0816 0.0686 0.0732 0.0601 0.0807 0.0793 0.0544 0.0376 0.0474 0.0687 0.0909 0.0924 0.0760 0.0904 0.0433 0.0780 0.0946 0.1199 0.1021
va: 2.3749 2.0782 2.0687 2.1412 3.0059 3.1307 3.8261 4.0093 3.7068 3.8462 3.9401 3.9812 4.0124 3.8300 3.9352 4.0580 3.9632 3.9287 3.7508 3.8747 3.8461 3.9127 4.3107 3.9584 3.9476 3.9076 1.0056 1.0032 1.0123 1.0087 1.0025 1.0068 1.0115 1.0026 1.0047 1.0011 1.0076 0.9975 1.0140 0.9988 0.9865 1.0148 1.0086 1.0163 1.0257 1.0099 1.0200 1.0096 1.0077 1.0065 1.0049 0.9986 1.0077 1.0092 1.0043 1.0103 1.0017 0.9909
dispcorr: -0.037743704 hartree
energy: -1514.936308097100
dipole: -10.27953 10.18411 -0.09542 -14.81384 14.17706 -0.63678 -22.77233 21.67541 -1.09693
magnitude: 1.27194 au
magnitude: 3.23302 debye
