program: Orca
programVersion: 5.0.2
elementType: S O O O N N C C C C C C C C C C C C C C C C C C C C H H H H H H H H H H H H H H H H H H H H H H H H H H H H H H H H
charge: 0
multiplicity: 1
keywords: wb97x-d3
keywords: def2-TZVPP
keywords: def2/J RIJCOSX
keywords: DEFGRID2
keywords: scfconv7
keywords: smallprint printgap noloewdin
keywords: NOSOSCF
formula: C20H32N2O3S
InChI: InChI=1/C20H32N2O3S/c1-6-8-13-22(14-9-7-2)26-21(5)19(23)24-17-12-10-11-16-15-20(3,4)25-18(16)17/h10-12H,6-9,13-15H2,1-5H3
58 atoms
S  -1.39173 2.398163 0.966238
O  0.948676 -1.526116 -0.004615
O  0.948849 0.884022 1.51293
O  -0.009793 -0.708158 2.787252
N  -1.492558 1.901182 -0.60555
N  -1.244821 1.022947 1.987343
C  1.220811 -2.903942 -0.368075
C  2.765671 -3.003875 -0.392655
C  3.165393 -1.834789 0.457239
C  2.0386 -1.047877 0.61754
C  0.578582 -3.162337 -1.7150
C  0.628565 -3.785391 0.721945
C  4.36761 -1.4534 1.020951
C  2.072424 0.112334 1.369845
C  4.417368 -0.27298 1.755583
C  3.276153 0.499029 1.935034
C  -2.669899 1.174523 -1.050745
C  -0.266853 1.705994 -1.372683
C  -2.50098 -0.342233 -1.097427
C  -0.414148 2.144756 -2.824146
C  -3.811196 -1.060115 -1.3923
C  -0.83064 3.599792 -2.988556
C  -0.094277 0.30598 2.151761
C  -3.642335 -2.569392 -1.487104
C  -0.906756 4.02586 -4.447277
C  -2.443866 0.462682 2.590702
H  3.160812 -2.906431 -1.409006
H  3.110306 -3.96256 -0.001149
H  -0.50295 -3.029572 -1.667326
H  0.774334 -4.186353 -2.034453
H  0.973918 -2.489425 -2.476677
H  1.072518 -3.564467 1.693544
H  0.802813 -4.838788 0.497853
H  -0.447164 -3.628627 0.80532
H  5.255858 -2.059448 0.896991
H  5.347446 0.043061 2.207397
H  3.31253 1.405975 2.52412
H  -2.960883 1.5342 -2.044603
H  -3.491115 1.439661 -0.381793
H  0.069366 0.664839 -1.333937
H  0.51107 2.303381 -0.896883
H  -1.764781 -0.609536 -1.862117
H  -2.087394 -0.700907 -0.150658
H  0.553359 1.982722 -3.309831
H  -1.116736 1.494458 -3.356922
H  -4.237562 -0.680557 -2.326015
H  -4.53972 -0.821953 -0.611074
H  -1.797073 3.763466 -2.505934
H  -0.120307 4.238218 -2.454714
H  -3.231899 -2.978848 -0.562098
H  -2.961523 -2.840722 -2.295876
H  -4.591916 -3.069994 -1.676343
H  -1.628474 3.421436 -4.999873
H  0.05827 3.917506 -4.94547
H  -1.210593 5.068251 -4.544478
H  -3.229367 1.212382 2.548313
H  -2.26817 0.200198 3.632454
H  -2.785243 -0.433029 2.066668
totalener: -1514.90114718 hartree
nucrepener: 2806.23943125 hartree
electener: -4321.14057843 hartree
oneelecener: -7650.38639334 hartree
twoeener: 3329.24581491 hartree
kineticenergy: 1509.14038215 hartree
xcener: -129.020099830640 hartree
chargesum: -0.0000000
charge: 0.037767 -0.334690 -0.317139 -0.379144 -0.131645 -0.177711 0.326710 -0.150868 -0.087144 0.299398 -0.276516 -0.295810 -0.165229 0.124931 -0.104022 -0.187139 -0.125599 -0.108604 -0.107508 -0.119156 -0.075401 -0.080611 0.423722 -0.270390 -0.256615 -0.166395 0.079427 0.088972 0.070151 0.099305 0.091223 0.117805 0.085550 0.088874 0.116167 0.118765 0.120594 0.086396 0.091260 0.081096 0.102375 0.060137 0.057237 0.075943 0.058739 0.060204 0.056791 0.060983 0.058142 0.076677 0.071667 0.096987 0.071093 0.071763 0.085702 0.095502 0.117855 0.091423
qa: 0.0378 -0.3347 -0.3171 -0.3791 -0.1316 -0.1777 0.3267 -0.1509 -0.0871 0.2994 -0.2765 -0.2958 -0.1652 0.1249 -0.1040 -0.1871 -0.1256 -0.1086 -0.1075 -0.1192 -0.0754 -0.0806 0.4237 -0.2704 -0.2566 -0.1664 0.0794 0.0890 0.0702 0.0993 0.0912 0.1178 0.0856 0.0889 0.1162 0.1188 0.1206 0.0864 0.0913 0.0811 0.1024 0.0601 0.0572 0.0759 0.0587 0.0602 0.0568 0.0610 0.0581 0.0767 0.0717 0.0970 0.0711 0.0718 0.0857 0.0955 0.1179 0.0914
va: 2.3584 2.0906 2.0825 2.1329 3.0106 3.1503 3.8236 3.9965 3.7138 3.8905 3.9251 3.9792 4.0152 3.8616 3.9296 4.0738 3.9733 3.9218 3.8115 3.8655 3.8728 3.8665 4.3052 3.9480 3.9488 3.9060 1.0047 1.0034 1.0167 1.0108 1.0094 1.0044 1.0072 1.0138 1.0059 1.0011 1.0073 0.9923 1.0175 1.0191 1.0145 1.0079 1.0161 1.0138 1.0041 1.0088 1.0085 1.0162 1.0118 1.0016 1.0000 1.0090 1.0030 1.0029 1.0061 1.0132 1.0046 0.9885
dispcorr: -0.034329875 hartree
energy: -1514.935477053913
dipole: -19.51867 19.39800 -0.12066 -9.33083 8.59792 -0.73291 -29.77278 28.67598 -1.09680
magnitude: 1.32465 au
magnitude: 3.36699 debye
