program: Orca
programVersion: 5.0.2
elementType: S O O O N N C C C C C C C C C C C C C C C C C C C C H H H H H H H H H H H H H H H H H H H H H H H H H H H H H H H H
charge: 0
multiplicity: 1
keywords: wb97x-d3
keywords: def2-TZVPP
keywords: def2/J RIJCOSX
keywords: DEFGRID2
keywords: scfconv7
keywords: smallprint printgap noloewdin
keywords: NOSOSCF
formula: C20H32N2O3S
InChI: InChI=1/C20H32N2O3S/c1-6-8-13-22(14-9-7-2)26-21(5)19(23)24-17-12-10-11-16-15-20(3,4)25-18(16)17/h10-12H,6-9,13-15H2,1-5H3
58 atoms
S  -0.456385 2.619513 0.302084
O  0.709995 -2.438055 0.647319
O  1.151766 0.399732 0.923088
O  2.030926 0.056606 -1.122113
N  -2.00444 2.119834 -0.008211
N  0.599379 1.785255 -0.762237
C  0.965124 -3.857703 0.480233
C  2.079517 -4.193436 1.50128
C  2.618739 -2.838845 1.840242
C  1.75212 -1.900989 1.299779
C  1.442831 -4.063382 -0.948585
C  -0.322601 -4.605536 0.760482
C  3.72734 -2.444771 2.561431
C  1.995488 -0.548082 1.450176
C  3.964499 -1.085611 2.735341
C  3.105712 -0.149039 2.178391
C  -2.418643 0.784191 0.394808
C  -2.724857 2.684105 -1.142079
C  -2.28681 -0.284312 -0.687075
C  -2.760111 4.203509 -1.156613
C  -2.79822 -1.641145 -0.224981
C  -3.60174 4.73816 -2.309399
C  1.317346 0.681491 -0.387212
C  -2.790839 -2.668672 -1.346919
C  -3.650148 6.258599 -2.345741
C  0.714944 2.199779 -2.15098
H  2.829813 -4.858253 1.069348
H  1.677716 -4.693586 2.387825
H  2.357708 -3.501876 -1.142649
H  0.689049 -3.73132 -1.662957
H  1.644567 -5.119119 -1.1355
H  -0.157576 -5.679322 0.664327
H  -1.108141 -4.325812 0.059744
H  -0.678769 -4.409165 1.772194
H  4.400949 -3.178514 2.98523
H  4.825958 -0.751474 3.296645
H  3.294569 0.909427 2.302486
H  -3.466704 0.840372 0.71296
H  -1.836665 0.502223 1.27342
H  -3.752937 2.314107 -1.070565
H  -2.336236 2.314101 -2.100368
H  -2.845682 0.021524 -1.577556
H  -1.243177 -0.380915 -0.996304
H  -3.160381 4.559293 -0.202975
H  -1.745487 4.602802 -1.231262
H  -3.815497 -1.538038 0.165996
H  -2.182172 -1.99429 0.605936
H  -3.203132 4.363455 -3.257181
H  -4.619804 4.343867 -2.23471
H  -1.783808 -2.80882 -1.74398
H  -3.426928 -2.352959 -2.175653
H  -3.154248 -3.639649 -1.008382
H  -2.652117 6.684253 -2.460538
H  -4.073729 6.662631 -1.425133
H  -4.259252 6.619611 -3.174426
H  0.33145 3.213094 -2.237699
H  0.143489 1.550815 -2.817089
H  1.753432 2.190692 -2.477104
totalener: -1514.89982975 hartree
nucrepener: 2726.90526359 hartree
electener: -4241.80509335 hartree
oneelecener: -7491.86499196 hartree
twoeener: 3250.05989862 hartree
kineticenergy: 1509.15170386 hartree
xcener: -129.019794667169 hartree
chargesum: 0.0000000
charge: 0.048442 -0.320830 -0.311650 -0.381270 -0.128084 -0.169893 0.315176 -0.141013 -0.065823 0.255208 -0.291612 -0.303682 -0.177511 0.112609 -0.112335 -0.160451 -0.102075 -0.120808 -0.113218 -0.094735 -0.096403 -0.079510 0.413957 -0.286699 -0.262318 -0.180135 0.088224 0.081221 0.116055 0.092983 0.084449 0.100488 0.095267 0.096017 0.116609 0.119177 0.117670 0.078139 0.101388 0.087428 0.072800 0.070567 0.071655 0.068950 0.053924 0.064488 0.063583 0.053396 0.054218 0.076212 0.087248 0.088986 0.075056 0.074510 0.085077 0.096942 0.103319 0.118617
qa: 0.0484 -0.3208 -0.3117 -0.3813 -0.1281 -0.1699 0.3152 -0.1410 -0.0658 0.2552 -0.2916 -0.3037 -0.1775 0.1126 -0.1123 -0.1605 -0.1021 -0.1208 -0.1132 -0.0947 -0.0964 -0.0795 0.4140 -0.2867 -0.2623 -0.1801 0.0882 0.0812 0.1161 0.0930 0.0844 0.1005 0.0953 0.0960 0.1166 0.1192 0.1177 0.0781 0.1014 0.0874 0.0728 0.0706 0.0717 0.0689 0.0539 0.0645 0.0636 0.0534 0.0542 0.0762 0.0872 0.0890 0.0751 0.0745 0.0851 0.0969 0.1033 0.1186
va: 2.3656 2.1238 2.0922 2.1304 3.0122 3.1629 3.8045 3.9897 3.6804 3.9693 3.9842 3.9391 4.0293 3.9164 3.9438 4.0713 3.9322 3.9400 3.7914 3.8657 3.8544 3.8809 4.2777 3.9452 3.9622 3.9037 1.0029 1.0049 1.0029 1.0106 1.0064 1.0095 1.0053 1.0065 1.0064 1.0014 1.0063 1.0009 1.0155 0.9948 0.9842 1.0113 1.0180 1.0206 1.0359 1.0140 1.0215 1.0080 1.0078 1.0002 1.0099 1.0002 1.0027 1.0027 1.0056 1.0003 0.9906 1.0084
dispcorr: -0.032120265 hartree
energy: -1514.931950019134
dipole: -29.54944 28.82387 -0.72557 -1.34045 0.75215 -0.58830 -19.03094 18.84850 -0.18244
magnitude: 0.95175 au
magnitude: 2.41916 debye
