program: Orca
programVersion: 5.0.2
elementType: S O O O N N C C C C C C C C C C C C C C C C C C C C H H H H H H H H H H H H H H H H H H H H H H H H H H H H H H H H
charge: 0
multiplicity: 1
keywords: wb97x-d3
keywords: def2-TZVPP
keywords: def2/J RIJCOSX
keywords: DEFGRID2
keywords: scfconv7
keywords: smallprint printgap noloewdin
keywords: NOSOSCF
formula: C20H32N2O3S
InChI: InChI=1/C20H32N2O3S/c1-6-8-13-22(14-9-7-2)26-21(5)19(23)24-17-12-10-11-16-15-20(3,4)25-18(16)17/h10-12H,6-9,13-15H2,1-5H3
58 atoms
S  -1.80168 2.324066 1.218955
O  0.887025 -1.256004 -0.092203
O  0.710184 1.062763 1.574929
O  0.003804 -0.713169 2.768105
N  -1.909913 1.956588 -0.390361
N  -1.463751 0.895429 2.115744
C  1.31638 -2.551487 -0.585322
C  2.846703 -2.410774 -0.764641
C  3.159805 -1.257935 0.142305
C  1.954081 -0.660161 0.466457
C  0.5788 -2.824408 -1.879544
C  0.98029 -3.579321 0.485086
C  4.347648 -0.738435 0.618929
C  1.901287 0.448859 1.292662
C  4.305032 0.387664 1.434462
C  3.090826 0.971314 1.773243
C  -3.019619 1.139901 -0.85555
C  -0.678372 1.896499 -1.172726
C  -2.706532 -0.347729 -1.000034
C  -0.882711 2.323798 -2.620147
C  -3.949774 -1.162713 -1.330484
C  0.437118 2.451134 -3.37741
C  -0.228569 0.318841 2.203232
C  -3.64272 -2.635189 -1.56008
C  1.211962 1.144336 -3.499068
C  -2.565619 0.159781 2.714461
H  3.111766 -2.177943 -1.801194
H  3.367731 -3.330899 -0.494992
H  0.775712 -2.045331 -2.617237
H  -0.498278 -2.879322 -1.716585
H  0.90103 -3.777202 -2.300386
H  -0.089152 -3.583853 0.69524
H  1.501662 -3.363596 1.418477
H  1.2679 -4.579014 0.15658
H  5.295176 -1.194825 0.363296
H  5.222271 0.810427 1.820373
H  3.059007 1.839777 2.417989
H  -3.367718 1.526467 -1.819537
H  -3.846838 1.282879 -0.157228
H  -0.235914 0.897133 -1.134953
H  0.036071 2.573645 -0.702819
H  -1.960513 -0.496059 -1.787492
H  -2.246708 -0.726029 -0.083035
H  -1.522612 1.609308 -3.148859
H  -1.408253 3.282379 -2.634449
H  -4.434655 -0.748668 -2.220087
H  -4.676949 -1.062899 -0.518745
H  0.228463 2.837409 -4.378051
H  1.064318 3.203367 -2.889949
H  -4.546276 -3.206801 -1.772352
H  -3.168953 -3.080615 -0.683374
H  -2.963906 -2.769674 -2.404127
H  1.55307 0.774858 -2.531533
H  2.094957 1.270085 -4.125902
H  0.596195 0.363964 -3.952327
H  -2.822561 -0.733415 2.139861
H  -3.433792 0.812565 2.748155
H  -2.321111 -0.149289 3.729365
totalener: -1514.89983863 hartree
nucrepener: 2853.26503485 hartree
electener: -4368.16487348 hartree
oneelecener: -7744.38022791 hartree
twoeener: 3376.21535444 hartree
kineticenergy: 1509.13698216 hartree
xcener: -129.020028216901 hartree
chargesum: -0.0000000
charge: 0.037160 -0.326515 -0.315061 -0.375907 -0.123815 -0.183614 0.326514 -0.161098 -0.066882 0.270553 -0.275431 -0.294685 -0.160920 0.128055 -0.104122 -0.191663 -0.121797 -0.087098 -0.099447 -0.115580 -0.075338 -0.104780 0.421620 -0.270068 -0.252456 -0.165286 0.079950 0.091693 0.085239 0.076232 0.101125 0.092023 0.115752 0.085339 0.116661 0.118738 0.121118 0.091512 0.090523 0.044678 0.101627 0.051560 0.058726 0.055692 0.085183 0.058802 0.058031 0.068706 0.058094 0.096812 0.077007 0.070756 0.069911 0.092052 0.069901 0.091272 0.095499 0.117446
qa: 0.0372 -0.3265 -0.3151 -0.3759 -0.1238 -0.1836 0.3265 -0.1611 -0.0669 0.2706 -0.2754 -0.2947 -0.1609 0.1281 -0.1041 -0.1917 -0.1218 -0.0871 -0.0994 -0.1156 -0.0753 -0.1048 0.4216 -0.2701 -0.2525 -0.1653 0.0800 0.0917 0.0852 0.0762 0.1011 0.0920 0.1158 0.0853 0.1167 0.1187 0.1211 0.0915 0.0905 0.0447 0.1016 0.0516 0.0587 0.0557 0.0852 0.0588 0.0580 0.0687 0.0581 0.0968 0.0770 0.0708 0.0699 0.0921 0.0699 0.0913 0.0955 0.1174
va: 2.3494 2.0725 2.0800 2.1385 3.0515 3.1458 3.8253 4.0025 3.6949 3.8826 3.9254 3.9784 4.0117 3.8631 3.9291 4.0694 3.9652 3.9375 3.7884 3.8635 3.8697 3.9068 4.3115 3.9474 3.9312 3.9054 1.0049 1.0035 1.0091 1.0144 1.0122 1.0142 1.0040 1.0068 1.0057 1.0010 1.0076 0.9928 1.0181 1.0032 1.0151 1.0097 1.0176 1.0080 1.0179 1.0097 1.0086 1.0078 1.0111 1.0091 1.0007 1.0005 1.0010 1.0087 1.0024 0.9884 1.0131 1.0048
dispcorr: -0.036224309 hartree
energy: -1514.936062936175
dipole: -13.25690 13.21016 -0.04674 -15.83135 15.17983 -0.65152 -29.28941 28.05795 -1.23146
magnitude: 1.39397 au
magnitude: 3.54319 debye
