program: Orca
programVersion: 5.0.2
elementType: S O O O N N C C C C C C C C C C C C C C C C C C C C H H H H H H H H H H H H H H H H H H H H H H H H H H H H H H H H
charge: 0
multiplicity: 1
keywords: wb97x-d3
keywords: def2-TZVPP
keywords: def2/J RIJCOSX
keywords: DEFGRID2
keywords: scfconv7
keywords: smallprint printgap noloewdin
keywords: NOSOSCF
formula: C20H32N2O3S
InChI: InChI=1/C20H32N2O3S/c1-6-8-13-22(14-9-7-2)26-21(5)19(23)24-17-12-10-11-16-15-20(3,4)25-18(16)17/h10-12H,6-9,13-15H2,1-5H3
58 atoms
S  -1.926348 2.253344 0.860789
O  0.796806 -1.500031 0.164562
O  0.577776 1.081529 1.35149
O  -0.051821 -0.407143 2.921366
N  -2.11522 1.667352 -0.666386
N  -1.584766 0.959825 1.943607
C  1.259138 -2.607979 -0.647813
C  2.793496 -2.663501 -0.429999
C  3.077366 -1.337458 0.209528
C  1.858822 -0.767034 0.530347
C  0.914673 -2.280685 -2.092995
C  0.547155 -3.854833 -0.163244
C  4.255674 -0.680715 0.510151
C  1.783719 0.468633 1.149772
C  4.190124 0.559541 1.135839
C  2.962992 1.126209 1.457593
C  -3.397496 1.15767 -1.129792
C  -0.96088 1.399023 -1.516212
C  -3.444703 -0.328612 -1.473752
C  0.044087 2.539135 -1.591858
C  -3.141278 -1.28059 -0.327425
C  1.316046 2.145413 -2.337493
C  -0.327999 0.461269 2.142662
C  -3.273967 -2.737315 -0.748979
C  1.093836 1.719524 -3.783102
C  -2.637812 0.395986 2.773726
H  3.325959 -2.809917 -1.372014
H  3.075579 -3.488203 0.231155
H  -0.158148 -2.117757 -2.209898
H  1.20518 -3.100217 -2.751863
H  1.433663 -1.380524 -2.428741
H  0.87169 -4.722519 -0.738933
H  -0.533267 -3.761533 -0.276229
H  0.763602 -4.043372 0.888335
H  5.213596 -1.118217 0.26012
H  5.099762 1.091112 1.378756
H  2.913027 2.095056 1.936817
H  -3.688708 1.722364 -2.024071
H  -4.140638 1.385136 -0.363971
H  -1.355126 1.2158 -2.519379
H  -0.45829 0.473308 -1.21338
H  -4.44804 -0.53475 -1.861733
H  -2.765252 -0.53836 -2.306365
H  -0.427347 3.398306 -2.079401
H  0.314084 2.862513 -0.586636
H  -3.82285 -1.078881 0.503964
H  -2.132291 -1.102218 0.052167
H  2.004984 2.993126 -2.317411
H  1.820659 1.342958 -1.790044
H  -4.282158 -2.961902 -1.101438
H  -3.055245 -3.414917 0.076708
H  -2.58542 -2.977064 -1.56228
H  2.041703 1.533098 -4.288606
H  0.56793 2.491843 -4.347855
H  0.506069 0.802957 -3.856383
H  -2.717654 -0.682138 2.63925
H  -3.579423 0.856166 2.488166
H  -2.459925 0.594979 3.830925
totalener: -1514.89724535 hartree
nucrepener: 2886.60677639 hartree
electener: -4401.50402174 hartree
oneelecener: -7811.11154831 hartree
twoeener: 3409.60752658 hartree
kineticenergy: 1509.13489873 hartree
xcener: -129.023630890203 hartree
chargesum: -0.0000000
charge: 0.035323 -0.321207 -0.308383 -0.365880 -0.120114 -0.175918 0.325877 -0.155904 -0.097412 0.345364 -0.315699 -0.274941 -0.144661 0.062627 -0.106801 -0.181317 -0.132077 -0.084610 -0.071510 -0.121225 -0.082155 -0.100479 0.410080 -0.290733 -0.269228 -0.182554 0.087896 0.086991 0.079975 0.102752 0.099888 0.090384 0.088454 0.099514 0.117058 0.119788 0.118028 0.093208 0.084922 0.094350 0.030471 0.075592 0.056567 0.075783 0.088366 0.058876 0.044799 0.074316 0.045434 0.091309 0.094646 0.066012 0.091677 0.085366 0.063122 0.103807 0.093885 0.120300
qa: 0.0353 -0.3212 -0.3084 -0.3659 -0.1201 -0.1759 0.3259 -0.1559 -0.0974 0.3454 -0.3157 -0.2749 -0.1447 0.0626 -0.1068 -0.1813 -0.1321 -0.0846 -0.0715 -0.1212 -0.0822 -0.1005 0.4101 -0.2907 -0.2692 -0.1826 0.0879 0.0870 0.0800 0.1028 0.0999 0.0904 0.0885 0.0995 0.1171 0.1198 0.1180 0.0932 0.0849 0.0944 0.0305 0.0756 0.0566 0.0758 0.0884 0.0589 0.0448 0.0743 0.0454 0.0913 0.0946 0.0660 0.0917 0.0854 0.0631 0.1038 0.0939 0.1203
va: 2.3770 2.0930 2.0627 2.1566 3.0303 3.1265 3.7797 4.0221 3.7236 3.8316 3.9721 3.9525 4.0098 3.8200 3.9217 4.0427 3.9658 3.9494 3.7343 3.8628 3.8409 3.8752 4.3254 3.9599 3.9335 3.9100 1.0025 1.0032 1.0092 1.0137 0.9970 1.0046 1.0108 1.0102 1.0046 1.0006 1.0091 0.9963 1.0148 0.9888 1.0058 1.0156 1.0102 1.0145 1.0311 1.0112 1.0180 1.0125 1.0178 1.0078 1.0000 0.9994 1.0057 1.0045 0.9992 0.9895 1.0091 1.0021
dispcorr: -0.038139531 hartree
energy: -1514.935384884831
dipole: -10.93318 10.83719 -0.09599 -14.25867 13.60920 -0.64946 -26.93504 25.63539 -1.29965
magnitude: 1.45606 au
magnitude: 3.70101 debye
