program: Orca
programVersion: 5.0.2
elementType: S O O O N N C C C C C C C C C C C C C C C C C C C C H H H H H H H H H H H H H H H H H H H H H H H H H H H H H H H H
charge: 0
multiplicity: 1
keywords: wb97x-d3
keywords: def2-TZVPP
keywords: def2/J RIJCOSX
keywords: DEFGRID2
keywords: scfconv7
keywords: smallprint printgap noloewdin
keywords: NOSOSCF
formula: C20H32N2O3S
InChI: InChI=1/C20H32N2O3S/c1-6-8-13-22(14-9-7-2)26-21(5)19(23)24-17-12-10-11-16-15-20(3,4)25-18(16)17/h10-12H,6-9,13-15H2,1-5H3
58 atoms
S  -1.959222 2.251424 0.752615
O  0.766358 -1.567951 0.127959
O  0.544842 1.061918 1.203255
O  -0.04067 -0.330302 2.874529
N  -2.206145 1.589735 -0.735075
N  -1.592009 1.011538 1.889313
C  1.229299 -2.735267 -0.59783
C  2.768313 -2.760712 -0.40157
C  3.047024 -1.403026 0.169244
C  1.827283 -0.818195 0.458566
C  0.858444 -2.533922 -2.05874
C  0.539309 -3.944554 0.001368
C  4.224561 -0.731893 0.439685
C  1.751805 0.444425 1.021199
C  4.158194 0.536888 1.004856
C  2.930212 1.116864 1.298079
C  -3.502114 1.053495 -1.12465
C  -1.082301 1.265234 -1.605835
C  -3.552692 -0.451093 -1.377426
C  -0.053831 2.374283 -1.754089
C  -3.204472 -1.328126 -0.184808
C  1.127833 1.924184 -2.604535
C  -0.335747 0.501534 2.063617
C  -3.302877 -2.809827 -0.517751
C  2.186539 3.005876 -2.754743
C  -2.617986 0.514813 2.793468
H  3.288644 -2.94434 -1.34436
H  3.071627 -3.550874 0.29186
H  -0.219226 -2.406408 -2.174311
H  1.161019 -3.397609 -2.652417
H  1.351469 -1.652376 -2.473579
H  -0.544145 -3.869846 -0.096709
H  0.778093 -4.04428 1.06032
H  0.861217 -4.853829 -0.507413
H  5.182905 -1.181574 0.213868
H  5.067316 1.079546 1.223849
H  2.879239 2.105804 1.734126
H  -3.823407 1.564079 -2.040643
H  -4.220272 1.325009 -0.349388
H  -1.502238 1.058105 -2.59517
H  -0.592556 0.339423 -1.2842
H  -4.566328 -0.686195 -1.719464
H  -2.898368 -0.707843 -2.216981
H  -0.531074 3.249833 -2.204982
H  0.30847 2.688899 -0.775038
H  -3.87647 -1.095756 0.646469
H  -2.194454 -1.102254 0.164485
H  1.582675 1.039319 -2.147395
H  0.77787 1.612337 -3.59398
H  -4.308413 -3.082425 -0.842623
H  -3.054348 -3.430918 0.343177
H  -2.617529 -3.077511 -1.324911
H  1.775966 3.903485 -3.219922
H  3.020635 2.667038 -3.369248
H  2.589995 3.292491 -1.782566
H  -2.401429 0.784602 3.827483
H  -2.708961 -0.569191 2.736593
H  -3.566632 0.961943 2.510397
totalener: -1514.89882913 hartree
nucrepener: 2875.70433307 hartree
electener: -4390.60316219 hartree
oneelecener: -7789.35660632 hartree
twoeener: 3398.75344413 hartree
kineticenergy: 1509.13734660 hartree
xcener: -129.022540272111 hartree
chargesum: 0.0000000
charge: 0.035968 -0.319640 -0.309663 -0.366511 -0.120357 -0.178567 0.313607 -0.160705 -0.094770 0.355100 -0.305042 -0.275869 -0.138792 0.060419 -0.109658 -0.189599 -0.125562 -0.068866 -0.079763 -0.138308 -0.077884 -0.059794 0.409008 -0.288663 -0.270684 -0.182120 0.087352 0.087675 0.081666 0.100832 0.101930 0.088994 0.100412 0.090423 0.117237 0.119867 0.118791 0.092250 0.084643 0.089607 0.033257 0.076262 0.058021 0.076149 0.078377 0.058078 0.045054 0.033559 0.062289 0.090886 0.094458 0.064201 0.075604 0.082615 0.077877 0.120317 0.103908 0.094125
qa: 0.0360 -0.3196 -0.3097 -0.3665 -0.1204 -0.1786 0.3136 -0.1607 -0.0948 0.3551 -0.3050 -0.2759 -0.1388 0.0604 -0.1097 -0.1896 -0.1256 -0.0689 -0.0798 -0.1383 -0.0779 -0.0598 0.4090 -0.2887 -0.2707 -0.1821 0.0874 0.0877 0.0817 0.1008 0.1019 0.0890 0.1004 0.0904 0.1172 0.1199 0.1188 0.0923 0.0846 0.0896 0.0333 0.0763 0.0580 0.0761 0.0784 0.0581 0.0451 0.0336 0.0623 0.0909 0.0945 0.0642 0.0756 0.0826 0.0779 0.1203 0.1039 0.0941
va: 2.3742 2.0922 2.0604 2.1560 3.0220 3.1242 3.8012 4.0299 3.7277 3.8308 3.9663 3.9520 4.0064 3.8007 3.9221 4.0398 3.9607 3.9258 3.7466 3.8876 3.8389 3.8662 4.3248 3.9609 3.9704 3.9089 1.0024 1.0025 1.0109 1.0118 1.0009 1.0116 1.0092 1.0048 1.0043 1.0006 1.0087 0.9968 1.0147 0.9975 1.0072 1.0153 1.0090 1.0161 1.0253 1.0105 1.0186 1.0118 1.0053 1.0076 1.0005 1.0004 1.0033 1.0057 1.0044 1.0017 0.9903 1.0093
dispcorr: -0.037373265 hartree
energy: -1514.936202391410
dipole: -9.44712 9.30804 -0.13908 -13.15806 12.40268 -0.75539 -23.58599 22.35423 -1.23176
magnitude: 1.45161 au
magnitude: 3.68971 debye
