program: Orca
programVersion: 5.0.2
elementType: S O O O N N C C C C C C C C C C C C C C C C C C C C H H H H H H H H H H H H H H H H H H H H H H H H H H H H H H H H
charge: 0
multiplicity: 1
keywords: wb97x-d3
keywords: def2-TZVPP
keywords: def2/J RIJCOSX
keywords: DEFGRID2
keywords: scfconv7
keywords: smallprint printgap noloewdin
keywords: NOSOSCF
formula: C20H32N2O3S
InChI: InChI=1/C20H32N2O3S/c1-6-8-13-22(14-9-7-2)26-21(5)19(23)24-17-12-10-11-16-15-20(3,4)25-18(16)17/h10-12H,6-9,13-15H2,1-5H3
58 atoms
S  -1.485842 2.223986 0.658463
O  1.243236 -1.649433 -0.281407
O  0.340245 0.284092 1.615996
O  2.214355 1.157411 0.723095
N  -2.154201 1.499873 -0.688457
N  0.217666 2.210531 0.459706
C  2.042582 -2.6632 -0.942516
C  2.33263 -3.717292 0.154434
C  2.068676 -2.943115 1.411149
C  1.428492 -1.772833 1.041455
C  3.323644 -1.992244 -1.414334
C  1.22852 -3.208025 -2.098654
C  2.306904 -3.217029 2.743902
C  1.020427 -0.84862 1.985416
C  1.893206 -2.29616 3.700918
C  1.258888 -1.119688 3.322672
C  -2.027821 0.047335 -0.797589
C  -2.022884 2.208407 -1.957412
C  -2.709684 -0.698127 0.338086
C  -2.590717 3.619096 -1.935327
C  -2.468196 -2.204083 0.282354
C  -2.53729 4.296665 -3.302692
C  1.030126 1.20411 0.908175
C  -2.983446 -2.879764 -0.982472
C  -1.125304 4.567794 -3.808962
C  0.877009 3.298794 -0.247718
H  3.353527 -4.096957 0.083749
H  1.66059 -4.577887 0.074433
H  3.888444 -1.586341 -0.573933
H  3.103484 -1.170655 -2.095881
H  3.958955 -2.70829 -1.937659
H  1.78595 -3.988421 -2.617563
H  0.999615 -2.425331 -2.822858
H  0.288104 -3.638316 -1.751461
H  2.802828 -4.131884 3.041987
H  2.072217 -2.4888 4.749759
H  0.94333 -0.401348 4.067856
H  -0.978645 -0.262493 -0.883231
H  -2.503318 -0.231535 -1.741112
H  -2.581778 1.63154 -2.700398
H  -0.978932 2.209946 -2.299677
H  -2.346863 -0.32088 1.295208
H  -3.782799 -0.486883 0.304872
H  -3.625875 3.565014 -1.588868
H  -2.059245 4.236402 -1.206927
H  -2.944778 -2.662652 1.151937
H  -1.398072 -2.399347 0.389636
H  -3.080676 3.692904 -4.036427
H  -3.077982 5.244026 -3.239133
H  -2.864631 -3.962407 -0.926675
H  -2.449296 -2.5449 -1.873215
H  -4.044408 -2.67505 -1.139059
H  -0.566586 3.649028 -3.990709
H  -0.556147 5.160065 -3.089416
H  -1.143471 5.122797 -4.747008
H  1.736904 3.663842 0.312172
H  0.166558 4.112859 -0.36191
H  1.220326 2.992427 -1.237195
totalener: -1514.89948167 hartree
nucrepener: 2789.24850347 hartree
electener: -4304.14798515 hartree
oneelecener: -7616.54046875 hartree
twoeener: 3312.39248360 hartree
kineticenergy: 1509.13493177 hartree
xcener: -129.016580290290 hartree
chargesum: -0.0000000
charge: 0.040966 -0.323865 -0.310183 -0.377744 -0.103980 -0.178350 0.324963 -0.165141 -0.056607 0.280210 -0.290214 -0.285116 -0.150832 0.085278 -0.115564 -0.172951 -0.147389 -0.136690 -0.103027 -0.109368 -0.091516 -0.100703 0.426695 -0.284058 -0.264372 -0.182051 0.090312 0.080486 0.115025 0.091879 0.083366 0.096520 0.094084 0.086808 0.117248 0.118730 0.119332 0.088853 0.086559 0.084161 0.082495 0.086965 0.072672 0.081038 0.068903 0.072127 0.044000 0.051658 0.071237 0.088539 0.069450 0.086525 0.074952 0.075415 0.091918 0.118948 0.096596 0.104808
qa: 0.0410 -0.3239 -0.3102 -0.3777 -0.1040 -0.1784 0.3250 -0.1651 -0.0566 0.2802 -0.2902 -0.2851 -0.1508 0.0853 -0.1156 -0.1730 -0.1474 -0.1367 -0.1030 -0.1094 -0.0915 -0.1007 0.4267 -0.2841 -0.2644 -0.1821 0.0903 0.0805 0.1150 0.0919 0.0834 0.0965 0.0941 0.0868 0.1172 0.1187 0.1193 0.0889 0.0866 0.0842 0.0825 0.0870 0.0727 0.0810 0.0689 0.0721 0.0440 0.0517 0.0712 0.0885 0.0695 0.0865 0.0750 0.0754 0.0919 0.1189 0.0966 0.1048
va: 2.3403 2.0793 2.0808 2.1376 3.0536 3.1485 3.8192 4.0202 3.7096 3.8570 3.9716 3.9317 4.0126 3.8805 3.9388 4.0637 3.9623 3.9522 3.8191 3.8483 3.8846 3.8887 4.2979 3.9348 3.9276 3.9076 1.0025 1.0046 1.0031 1.0144 1.0064 1.0084 1.0092 1.0042 1.0050 1.0012 1.0063 1.0131 0.9966 1.0028 0.9898 1.0302 1.0190 1.0242 1.0285 1.0112 1.0209 1.0099 1.0085 1.0048 0.9977 1.0052 1.0028 1.0038 1.0076 1.0067 1.0011 0.9898
dispcorr: -0.033615618 hartree
energy: -1514.933097291854
dipole: -12.19466 12.08727 -0.10740 -1.00281 0.36828 -0.63452 -29.43648 28.50757 -0.92890
magnitude: 1.13005 au
magnitude: 2.87236 debye
