program: Orca
programVersion: 5.0.2
elementType: S O O O N N C C C C C C C C C C C C C C C C C C C C H H H H H H H H H H H H H H H H H H H H H H H H H H H H H H H H
charge: 0
multiplicity: 1
keywords: wb97x-d3
keywords: def2-TZVPP
keywords: def2/J RIJCOSX
keywords: DEFGRID2
keywords: scfconv7
keywords: smallprint printgap noloewdin
keywords: NOSOSCF
formula: C20H32N2O3S
InChI: InChI=1/C20H32N2O3S/c1-6-8-13-22(14-9-7-2)26-21(5)19(23)24-17-12-10-11-16-15-20(3,4)25-18(16)17/h10-12H,6-9,13-15H2,1-5H3
58 atoms
S  -1.501074 2.272724 0.66089
O  0.958199 -1.748909 -0.137932
O  0.839479 0.772058 1.184886
O  -0.05517 -0.705079 2.631405
N  -1.730778 1.692101 -0.861718
N  -1.33404 0.948583 1.74497
C  1.278332 -3.145244 -0.363497
C  2.825689 -3.1992 -0.343693
C  3.167488 -1.947982 0.409639
C  2.013366 -1.185859 0.470621
C  0.677626 -3.548394 -1.693857
C  0.686059 -3.938449 0.792075
C  4.340793 -1.482666 0.970583
C  1.991694 0.030289 1.127335
C  4.335284 -0.243706 1.604116
C  3.166584 0.502484 1.688623
C  -3.059784 1.33754 -1.330316
C  -0.605849 1.507366 -1.76899
C  -3.61167 0.022766 -0.791959
C  -0.546311 2.558634 -2.872552
C  -2.720988 -1.18787 -1.032456
C  -0.40652 3.982223 -2.351269
C  -0.172607 0.250094 1.914885
C  -3.317624 -2.468645 -0.466713
C  -0.287344 5.009691 -3.46713
C  -2.468228 0.498086 2.535909
H  3.244629 -3.179601 -1.355052
H  3.187775 -4.108152 0.139659
H  0.91187 -4.590753 -1.911664
H  1.070146 -2.936418 -2.506451
H  -0.408408 -3.446956 -1.683448
H  -0.394317 -3.800762 0.843358
H  1.106569 -3.619588 1.746721
H  0.889237 -5.003084 0.668087
H  5.249556 -2.068747 0.922362
H  5.242498 0.139288 2.050666
H  3.15781 1.455501 2.201137
H  -3.01762 1.290946 -2.422156
H  -3.756471 2.144617 -1.08766
H  -0.645628 0.504993 -2.207174
H  0.310866 1.547762 -1.184078
H  -3.81037 0.1247 0.277662
H  -4.58977 -0.141873 -1.256859
H  0.305487 2.317042 -3.516796
H  -1.431372 2.488683 -3.514664
H  -1.738332 -1.021475 -0.585599
H  -2.551344 -1.307826 -2.107703
H  -1.267036 4.227455 -1.723885
H  0.468831 4.04424 -1.697909
H  -2.668411 -3.326367 -0.647655
H  -4.288646 -2.692335 -0.911682
H  -3.46062 -2.393972 0.612844
H  -1.163593 4.993188 -4.117654
H  0.586941 4.819839 -4.092046
H  -0.19398 6.020555 -3.069659
H  -2.800185 -0.498682 2.241601
H  -3.285387 1.198798 2.390314
H  -2.218884 0.471069 3.596059
totalener: -1514.89955949 hartree
nucrepener: 2813.21587639 hartree
electener: -4328.11543588 hartree
oneelecener: -7664.53915925 hartree
twoeener: 3336.42372336 hartree
kineticenergy: 1509.14423021 hartree
xcener: -129.023620023861 hartree
chargesum: 0.0000000
charge: 0.042301 -0.329969 -0.322583 -0.380259 -0.163048 -0.159083 0.316770 -0.139288 -0.069058 0.293238 -0.277302 -0.294815 -0.169473 0.104842 -0.101172 -0.193315 -0.116129 -0.086361 -0.121475 -0.117734 -0.090948 -0.077493 0.424105 -0.258267 -0.261902 -0.191161 0.078575 0.088761 0.094786 0.089203 0.086963 0.090479 0.116927 0.085886 0.116291 0.118313 0.120070 0.084186 0.104222 0.097925 0.095419 0.068095 0.077004 0.068163 0.053848 0.041574 0.068111 0.051023 0.065437 0.068956 0.084556 0.080422 0.070893 0.072433 0.085780 0.100230 0.094304 0.120745
qa: 0.0423 -0.3300 -0.3226 -0.3803 -0.1630 -0.1591 0.3168 -0.1393 -0.0691 0.2932 -0.2773 -0.2948 -0.1695 0.1048 -0.1012 -0.1933 -0.1161 -0.0864 -0.1215 -0.1177 -0.0909 -0.0775 0.4241 -0.2583 -0.2619 -0.1912 0.0786 0.0888 0.0948 0.0892 0.0870 0.0905 0.1169 0.0859 0.1163 0.1183 0.1201 0.0842 0.1042 0.0979 0.0954 0.0681 0.0770 0.0682 0.0538 0.0416 0.0681 0.0510 0.0654 0.0690 0.0846 0.0804 0.0709 0.0724 0.0858 0.1002 0.0943 0.1207
va: 2.3891 2.1063 2.0727 2.1333 2.9832 3.1556 3.8231 3.9795 3.7001 3.9106 3.9289 3.9816 4.0212 3.8471 3.9260 4.0803 3.9615 3.9243 3.8421 3.8711 3.8330 3.8573 4.2954 3.9540 3.9675 3.9205 1.0055 1.0035 1.0075 1.0111 1.0112 1.0117 1.0046 1.0068 1.0062 1.0012 1.0072 1.0002 1.0098 1.0017 1.0137 1.0105 1.0200 1.0177 1.0141 1.0196 1.0047 1.0175 1.0090 1.0102 1.0055 1.0019 1.0022 1.0031 1.0052 0.9850 1.0107 1.0047
dispcorr: -0.034585053 hartree
energy: -1514.934144542946
dipole: -17.28791 17.16014 -0.12777 -5.76979 5.17703 -0.59277 -23.07253 22.04685 -1.02568
magnitude: 1.19152 au
magnitude: 3.02860 debye
