program: Orca
programVersion: 5.0.2
elementType: S O O O N N C C C C C C C C C C C C C C C C C C C C H H H H H H H H H H H H H H H H H H H H H H H H H H H H H H H H
charge: 0
multiplicity: 1
keywords: wb97x-d3
keywords: def2-TZVPP
keywords: def2/J RIJCOSX
keywords: DEFGRID2
keywords: scfconv7
keywords: smallprint printgap noloewdin
keywords: NOSOSCF
formula: C20H32N2O3S
InChI: InChI=1/C20H32N2O3S/c1-6-8-13-22(14-9-7-2)26-21(5)19(23)24-17-12-10-11-16-15-20(3,4)25-18(16)17/h10-12H,6-9,13-15H2,1-5H3
58 atoms
S  -1.939752 2.274908 0.859994
O  0.846956 -1.533457 0.119473
O  0.579671 1.07262 1.252192
O  0.013073 -0.328667 2.920583
N  -2.240088 1.598182 -0.617428
N  -1.544379 1.043404 1.993552
C  1.34856 -2.626836 -0.691145
C  2.858004 -2.712998 -0.356245
C  3.122334 -1.369078 0.254542
C  1.892499 -0.788402 0.51077
C  1.131686 -2.250878 -2.149382
C  0.574819 -3.871858 -0.309642
C  4.288882 -0.706508 0.584363
C  1.795867 0.461665 1.096331
C  4.201377 0.54976 1.174931
C  2.963835 1.125071 1.434148
C  -3.559486 1.055235 -0.903102
C  -1.126778 1.222679 -1.485756
C  -3.916725 -0.283047 -0.260862
C  -0.15778 2.363275 -1.758568
C  -2.986316 -1.455537 -0.555103
C  1.085342 1.904603 -2.515097
C  -0.289753 0.515706 2.125439
C  -2.972759 -1.891229 -2.014347
C  0.802376 1.315228 -3.89131
C  -2.54259 0.546378 2.927958
H  3.455407 -2.909327 -1.248637
H  3.067454 -3.51592 0.357228
H  1.685736 -1.34763 -2.412654
H  0.075092 -2.070687 -2.352402
H  1.469447 -3.053668 -2.806147
H  0.932829 -4.727918 -0.882503
H  -0.4899 -3.752706 -0.515337
H  0.693104 -4.097777 0.749961
H  5.254928 -1.151773 0.384206
H  5.101735 1.086829 1.439332
H  2.897697 2.104967 1.888324
H  -3.64882 0.985304 -1.990837
H  -4.301646 1.792837 -0.587835
H  -1.57075 0.900653 -2.430132
H  -0.582736 0.356943 -1.096049
H  -3.985433 -0.145813 0.819881
H  -4.931539 -0.536866 -0.587431
H  -0.675154 3.146653 -2.32108
H  0.153633 2.811582 -0.814328
H  -3.306559 -2.302187 0.058335
H  -1.972404 -1.22307 -0.221545
H  1.760261 2.756827 -2.623538
H  1.627215 1.175113 -1.904784
H  -2.589177 -1.115164 -2.677897
H  -3.975633 -2.149009 -2.360286
H  -2.344783 -2.772254 -2.155929
H  1.728252 1.077386 -4.41585
H  0.243628 2.016096 -4.514656
H  0.221651 0.393038 -3.834274
H  -2.750787 -0.512687 2.771066
H  -3.458301 1.112185 2.782389
H  -2.214828 0.67718 3.958821
totalener: -1514.89679630 hartree
nucrepener: 2889.86633487 hartree
electener: -4404.76313116 hartree
oneelecener: -7817.61827022 hartree
twoeener: 3412.85513906 hartree
kineticenergy: 1509.13267461 hartree
xcener: -129.024419603894 hartree
chargesum: 0.0000000
charge: 0.033541 -0.322669 -0.308073 -0.369184 -0.110691 -0.172770 0.335905 -0.145199 -0.097993 0.338993 -0.337383 -0.270453 -0.144178 0.059394 -0.115302 -0.171511 -0.122128 -0.090886 -0.155907 -0.115053 -0.043525 -0.108847 0.417626 -0.287224 -0.275348 -0.189801 0.087651 0.085161 0.109139 0.086132 0.102029 0.090801 0.083671 0.098584 0.117397 0.119632 0.118671 0.084762 0.101904 0.087096 0.028857 0.083984 0.073049 0.074015 0.085718 0.079588 0.032488 0.076127 0.048541 0.077163 0.093919 0.077940 0.094121 0.087053 0.063433 0.105894 0.093429 0.120719
qa: 0.0335 -0.3227 -0.3081 -0.3692 -0.1107 -0.1728 0.3359 -0.1452 -0.0980 0.3390 -0.3374 -0.2705 -0.1442 0.0594 -0.1153 -0.1715 -0.1221 -0.0909 -0.1559 -0.1151 -0.0435 -0.1088 0.4176 -0.2872 -0.2753 -0.1898 0.0877 0.0852 0.1091 0.0861 0.1020 0.0908 0.0837 0.0986 0.1174 0.1196 0.1187 0.0848 0.1019 0.0871 0.0289 0.0840 0.0730 0.0740 0.0857 0.0796 0.0325 0.0761 0.0485 0.0772 0.0939 0.0779 0.0941 0.0871 0.0634 0.1059 0.0934 0.1207
va: 2.3749 2.0972 2.0690 2.1520 3.0293 3.1340 3.7623 4.0008 3.7212 3.8430 3.9763 3.9431 4.0064 3.8253 3.9315 4.0585 3.9485 3.9661 3.8708 3.8765 3.7967 3.8765 4.3094 3.9390 3.9279 3.9162 1.0028 1.0040 0.9937 1.0051 1.0153 1.0039 1.0105 1.0116 1.0046 1.0011 1.0074 0.9954 1.0125 0.9919 1.0030 1.0112 1.0205 1.0164 1.0330 1.0073 1.0347 1.0133 1.0162 0.9968 1.0094 1.0059 1.0045 1.0063 0.9994 0.9854 1.0090 1.0034
dispcorr: -0.038649647 hartree
energy: -1514.935445942995
dipole: -11.41268 11.33266 -0.08003 -14.07613 13.37261 -0.70353 -28.00967 26.84268 -1.16698
magnitude: 1.36499 au
magnitude: 3.46954 debye
