program: Gaussian 09
title: 000065081
version: EM64L-G09RevD.01
frameworkgroup: C1[X(C7H15O5P)]
method: RPBEPBE
basis: SDD
operation: Freq
keyword: #p
keyword: freq=noraman
keyword: PBEPBE/SDD
title: #p freq=noraman PBEPBE/SDD
converged: YES YES NO NO
title: Mulliken charges:
elementType: P O O O O O C C C C C C C H H H H H H H H H H H H H H H
charge: 1.288421 -0.536211 -0.504738 -0.208226 -0.593188 -0.191938 -0.213730 -0.227495 -0.030801 -0.244202 -0.653464 -0.656966 -0.664062 0.213899 0.242519 0.220164 0.246987 0.240015 0.239102 0.210285 0.231715 0.228107 0.206052 0.235828 0.227927 0.215180 0.236926 0.241896
chargesum: 0.00000
title: Mulliken charges with hydrogens summed into heavy atoms:
elementType: P O O O O O C C C C C C C
charge: 1.288421 -0.536211 -0.504738 -0.208226 -0.593188 -0.191938 0.242687 0.239656 -0.030801 0.234915 0.016644 0.012840 0.029940
polarizability: 1.42962084e+02 3.96776655e+00 1.21584163e+02 2.37440365e+00 6.87669144e+00 1.02638110e+02
1716.lowfreq: -8.2314 -5.5744 0.0004 0.0012 0.0016 2.4526 11.9387 14.0183 35.8378
frequency: 3.4896 11.6501 35.7415 44.4998 47.7144 71.4118 75.6634 102.4122 127.6778 135.1090 183.0837 192.5857 231.6383 237.9953 245.1449 248.9398 279.4227 289.0499 297.9488 361.5347 373.8860 431.7309 493.7512 591.4178 624.7797 683.6178 778.1649 793.9235 798.4215 806.0047 808.5208 872.1096 873.9438 1006.4970 1012.7370 1021.4419 1047.3064 1101.3744 1104.2884 1109.6733 1117.8490 1127.9037 1133.4687 1134.1788 1247.1713 1251.4319 1254.2612 1347.5456 1354.1816 1356.4477 1393.7510 1394.1507 1403.3422 1456.7484 1457.8107 1461.3217 1469.5859 1477.7440 1479.8969 1483.4624 1490.6025 1494.8859 1627.2631 2989.8383 2992.3816 2994.9598 3000.5941 3002.5359 3018.2030 3054.2665 3069.8893 3081.5369 3089.6464 3090.6313 3096.8187 3108.6473 3110.8310 3116.8662
redmass: 3.4399 2.6587 2.3065 2.9167 3.0299 3.0322 2.6599 4.1116 3.0926 4.5347 5.0746 3.4187 1.5880 1.6592 1.4993 1.7330 2.9618 6.7130 4.9629 3.6276 4.7697 6.3611 11.8170 8.3949 6.6907 6.8244 5.8239 5.3736 1.1131 1.0901 1.0944 3.8631 4.3372 2.1097 2.5427 2.6087 13.4333 2.5379 2.3953 3.4551 2.8766 1.4347 1.4281 1.4406 1.1514 1.1473 1.1425 1.3399 1.2562 1.2439 1.2437 1.2469 1.2480 1.0400 1.0405 1.0389 1.0762 1.0503 1.0478 1.0595 1.0819 1.0862 11.4875 1.0520 1.0364 1.0412 1.0362 1.0580 1.0579 1.1075 1.1063 1.1073 1.0976 1.0981 1.0982 1.1022 1.1027 1.1033
irintensity: 0.8159 0.8819 0.3083 1.0870 1.6715 2.6591 3.9562 1.3837 1.1108 0.7165 2.2911 16.5358 10.8441 8.1951 3.0688 5.1207 7.8315 3.6671 11.8113 9.4601 9.7386 19.1112 75.0319 19.6099 66.9799 109.5942 10.7293 19.9376 5.0999 4.1285 1.9202 175.8707 176.5323 102.7491 136.9444 116.5477 73.7316 86.6891 40.9072 128.9401 112.3157 8.5284 8.0720 8.5667 0.1217 0.5333 1.2446 8.6609 5.3616 4.4481 16.6050 32.2891 27.1237 11.0161 13.0314 13.2749 5.3598 6.1960 4.6653 15.0812 15.1516 3.7761 194.3488 29.2077 22.4730 27.0951 15.8659 24.7900 13.8458 11.1122 4.8399 5.1805 27.0681 31.2041 22.2405 35.1679 37.3677 34.0515
temp: 298.150 k
press: 1.00000 atm
elementType: 15 8 8 8 8 8 6 6 6 6 6 6 6 1 1 1 1 1 1 1 1 1 1 1 1 1 1 1
symmnumber: 1
zpe: 578926.5 jmol-1
zpe.correction: 0.220501 hartree
zpe.thermalcorrener: 0.238437 hartree
zpe.thermalcorrenthalpy: 0.239381 hartree
zpe.thermalcorrgfe: 0.168864 hartree
zpe.sumelectzpe: -991.993065 hartree
zpe.sumelectthermal: -991.975129 hartree
zpe.sumelectthermalent: -991.974185 hartree
zpe.sumelectthermalfe: -992.044703 hartree
dipole: 1.2957 0.8824 -3.7007
dipole: 4.0190
quadrupole: -63.3581 -80.1707 -97.4218
quadrupole: -3.7003 1.4222 -1.5030
quadrupole: 16.9587 0.1462 -17.1049 -3.7003 1.4222 -1.5030
hfenergy: -992.2135665 hartree
pointgroup: C01 [X(C7H15O5P1)]
dipole: -0.4428603 0.5649369 1.4088675 debye
polarizability: 138.9348402|-8.8036731|124.5404058|2.1955858|-8.9262184|103.7091107 unknown
InChI: InChI=1S/C7H15O5P/c1-4-10-7(8)13(9,11-5-2)12-6-3/h4-6H2,1-3H3
charge 0 multiplicity 1
28 atoms
P  0.430807 -0.118268 -0.454393
O  1.134869 1.005507 0.681407
O  1.286555 -1.60728 -0.25348
O  -2.159694 0.503497 0.041625
O  0.402001 0.346059 -1.971752
O  -1.395939 -1.267042 1.363956
C  2.199726 1.9337 0.189317
C  1.705013 -2.099116 1.100159
C  -1.229346 -0.394016 0.491528
C  -3.536532 0.423339 0.661843
C  2.361692 3.008134 1.260486
C  2.745905 -3.18524 0.847118
C  -4.382427 1.481232 -0.032484
H  3.133288 1.357495 0.042104
H  1.885194 2.357458 -0.782652
H  2.119308 -1.252996 1.680468
H  0.810357 -2.488919 1.616666
H  -3.912245 -0.603339 0.505452
H  -3.423233 0.601591 1.745929
H  3.15415 3.718956 0.960794
H  1.420797 3.567814 1.395188
H  2.643356 2.558322 2.227858
H  3.082644 -3.61264 1.810338
H  2.31687 -3.997076 0.235873
H  3.621932 -2.775551 0.316332
H  -5.407022 1.464975 0.381751
H  -3.960784 2.488484 0.121909
H  -4.441641 1.289522 -1.11674
