program: Orca
programVersion: 5.0.4
elementType: S S P O O C C C C C C C C C C H H H H H H H H H H H H H H H H H H H H H H H
charge: 0
multiplicity: 1
keywords: wb97x-d3
keywords: def2-TZVPP
keywords: def2/J RIJCOSX
keywords: DEFGRID2
keywords: scfconv7
keywords: smallprint printgap noloewdin
keywords: NOSOSCF
formula: C10H23O2PS2
InChI: InChI=1/C10H23O2PS2/c1-6-9(4)14-13(11,12-8-3)15-10(5)7-2/h9-10H,6-8H2,1-5H3
38 atoms
S  1.34343 0.150655 -0.819298
S  -1.321764 -0.397712 1.265813
P  -0.15542 1.029997 0.309648
O  -1.023573 1.578264 -0.918541
O  0.303465 2.015722 1.326397
C  2.690476 0.024921 0.444777
C  -1.730322 -1.550262 -0.126794
C  4.002849 -0.151952 -0.310909
C  -0.989135 -2.863284 0.090167
C  2.437779 -1.108145 1.418549
C  -3.240067 -1.689889 -0.201888
C  4.395669 1.021826 -1.19227
C  -1.183274 -3.842761 -1.058611
C  -2.272547 2.273803 -0.694434
C  -2.057076 3.76214 -0.58431
H  2.710614 0.980439 0.971065
H  -1.372177 -1.087854 -1.048903
H  3.972743 -1.077284 -0.893029
H  4.771125 -0.30109 0.452845
H  0.075476 -2.647801 0.201748
H  -1.31808 -3.317471 1.028868
H  2.385929 -2.068806 0.905496
H  1.514188 -0.972181 1.97909
H  3.256394 -1.152446 2.139436
H  -3.720703 -0.7227 -0.345798
H  -3.646965 -2.144914 0.70233
H  -3.516868 -2.321775 -1.046587
H  4.397257 1.954912 -0.626459
H  3.720718 1.148885 -2.038741
H  5.398563 0.87785 -1.59416
H  -0.907384 -3.391007 -2.013399
H  -2.213743 -4.188925 -1.138487
H  -0.555333 -4.722597 -0.917065
H  -2.768813 1.880019 0.195713
H  -2.896556 2.028766 -1.552201
H  -1.57279 4.162688 -1.474623
H  -3.025173 4.253167 -0.481724
H  -1.458085 4.022717 0.287458
elementType: S P O C H
totalener: -1683.31630187 hartree
nucrepener: 1576.89666280 hartree
electener: -3260.21296467 hartree
oneelecener: -5451.56702919 hartree
twoeener: 2191.35406452 hartree
cpcmener: -0.02683519 hartree
kineticenergy: 1678.54931075 hartree
xcener: -109.976606578375 hartree
chargesum: -0.0000000
charge: -0.196015 -0.202185 0.738396 -0.353399 -0.656376 0.081782 0.069772 -0.104816 -0.083568 -0.315483 -0.286592 -0.269071 -0.283967 0.047331 -0.244775 0.080941 0.071210 0.079034 0.080242 0.064772 0.077470 0.096412 0.097859 0.113069 0.102656 0.101032 0.102043 0.082954 0.079623 0.095593 0.085479 0.089578 0.096225 0.087998 0.110682 0.090195 0.096148 0.077752
qa: -0.1960 -0.2022 0.7384 -0.3534 -0.6564 0.0818 0.0698 -0.1048 -0.0836 -0.3155 -0.2866 -0.2691 -0.2840 0.0473 -0.2448 0.0809 0.0712 0.0790 0.0802 0.0648 0.0775 0.0964 0.0979 0.1131 0.1027 0.1010 0.1020 0.0830 0.0796 0.0956 0.0855 0.0896 0.0962 0.0880 0.1107 0.0902 0.0961 0.0778
va: 2.3077 2.2735 5.3941 2.0807 1.9503 3.8258 3.8165 3.8493 3.8716 3.9437 3.9553 3.9510 3.9600 3.8347 3.9518 1.0395 1.0344 1.0131 1.0060 1.0196 1.0148 0.9995 1.0220 1.0067 1.0049 1.0014 0.9984 1.0014 1.0082 1.0044 0.9993 1.0002 1.0038 1.0087 0.9887 1.0040 1.0068 1.0199
dispcorr: -0.018228987 hartree
energy: -1683.334530857343
dipole: 2.21927 -2.86166 -0.64238 -10.88581 9.30664 -1.57917 -6.00679 4.89584 -1.11095
magnitude: 2.03486 au
magnitude: 5.17221 debye
