program: Orca
programVersion: 5.0.4
elementType: S S P O O C C C C C C C C C C H H H H H H H H H H H H H H H H H H H H H H H
charge: 0
multiplicity: 1
keywords: wb97x-d3
keywords: def2-TZVPP
keywords: def2/J RIJCOSX
keywords: DEFGRID2
keywords: scfconv7
keywords: smallprint printgap noloewdin
keywords: NOSOSCF
formula: C10H23O2PS2
InChI: InChI=1/C10H23O2PS2/c1-6-9(4)14-13(11,12-8-3)15-10(5)7-2/h9-10H,6-8H2,1-5H3
38 atoms
S  1.278723 0.563328 1.35292
S  -0.708532 -0.560227 -1.159288
P  -0.565548 0.753468 0.445903
O  -0.469314 2.158141 -0.311348
O  -1.634855 0.598607 1.470806
C  2.475156 0.784689 -0.043833
C  -1.073971 -2.140262 -0.269187
C  3.587975 -0.246625 0.103993
C  -2.581684 -2.317409 -0.143712
C  2.99979 2.207382 -0.048956
C  -0.389292 -3.256579 -1.038555
C  3.144471 -1.684263 -0.102573
C  -2.966205 -3.556194 0.65178
C  -1.61785 2.726576 -0.988028
C  -2.321628 3.720821 -0.101239
H  1.928408 0.581686 -0.967625
H  -0.620861 -2.063624 0.722517
H  4.073212 -0.129513 1.077263
H  4.34726 0.006557 -0.641433
H  -3.005863 -1.43642 0.339191
H  -3.019243 -2.36615 -1.144359
H  2.197179 2.93709 -0.137211
H  3.670691 2.343704 -0.899152
H  3.562089 2.427099 0.859195
H  -0.533739 -4.20672 -0.524587
H  0.683362 -3.087656 -1.119035
H  -0.797872 -3.358838 -2.045235
H  2.401148 -1.992664 0.633365
H  3.99253 -2.364116 -0.017849
H  2.709333 -1.821866 -1.093579
H  -4.046289 -3.593833 0.79312
H  -2.504531 -3.553178 1.6407
H  -2.673952 -4.478242 0.149369
H  -2.299729 1.93691 -1.311645
H  -1.22137 3.204194 -1.882253
H  -1.652024 4.521978 0.211266
H  -3.145443 4.170747 -0.655967
H  -2.736139 3.244054 0.786591
elementType: S P O C H
totalener: -1683.31704940 hartree
nucrepener: 1578.32430760 hartree
electener: -3261.64135700 hartree
oneelecener: -5454.52948715 hartree
twoeener: 2192.88813015 hartree
cpcmener: -0.02637280 hartree
kineticenergy: 1678.54576388 hartree
xcener: -109.975437806135 hartree
chargesum: -0.0000000
charge: -0.194016 -0.211095 0.739474 -0.354703 -0.657317 0.073324 0.098514 -0.092259 -0.105805 -0.278866 -0.294262 -0.279288 -0.287174 0.048776 -0.243188 0.076226 0.072682 0.078115 0.077180 0.073302 0.068375 0.095769 0.098896 0.094285 0.104117 0.107667 0.102787 0.076162 0.102446 0.079340 0.095948 0.087068 0.087139 0.090177 0.108327 0.089539 0.095328 0.077010
qa: -0.1940 -0.2111 0.7395 -0.3547 -0.6573 0.0733 0.0985 -0.0923 -0.1058 -0.2789 -0.2943 -0.2793 -0.2872 0.0488 -0.2432 0.0762 0.0727 0.0781 0.0772 0.0733 0.0684 0.0958 0.0989 0.0943 0.1041 0.1077 0.1028 0.0762 0.1024 0.0793 0.0959 0.0871 0.0871 0.0902 0.1083 0.0895 0.0953 0.0770
va: 2.2950 2.2789 5.4037 2.0861 1.9398 3.8001 3.7866 3.8556 3.8900 3.9461 3.9379 3.9543 3.9564 3.8467 3.9397 1.0410 1.0380 1.0114 1.0068 1.0314 1.0167 1.0184 1.0026 1.0048 0.9982 1.0079 1.0019 1.0056 1.0075 1.0001 1.0038 0.9985 0.9993 1.0080 0.9919 1.0034 1.0074 1.0200
dispcorr: -0.018375208 hartree
energy: -1683.335424608184
dipole: 2.94458 -1.86798 1.07659 -10.15904 9.80527 -0.35376 -6.01793 4.07726 -1.94067
magnitude: 2.24731 au
magnitude: 5.71221 debye
