program: Orca
programVersion: 5.0.4
elementType: S S P O O C C C C C C C C C C H H H H H H H H H H H H H H H H H H H H H H H
charge: 0
multiplicity: 1
keywords: wb97x-d3
keywords: def2-TZVPP
keywords: def2/J RIJCOSX
keywords: DEFGRID2
keywords: scfconv7
keywords: smallprint printgap noloewdin
keywords: NOSOSCF
formula: C10H23O2PS2
InChI: InChI=1/C10H23O2PS2/c1-6-9(4)14-13(11,12-8-3)15-10(5)7-2/h9-10H,6-8H2,1-5H3
38 atoms
S  1.683805 1.358052 -0.80055
S  -0.26222 -1.321868 -0.838015
P  -0.11221 0.60148 -0.082139
O  -1.145144 1.419769 -0.99385
O  -0.332963 0.686047 1.388408
C  2.949461 0.89753 0.469076
C  -1.399042 -2.121216 0.382595
C  3.016105 -0.59656 0.753748
C  -2.834949 -1.637456 0.222873
C  2.819992 1.742573 1.722536
C  -1.23977 -3.617486 0.16369
C  3.424346 -1.443099 -0.438599
C  -3.740595 -2.149651 1.335708
C  -1.497807 2.784531 -0.671972
C  -2.711829 2.842573 0.222893
H  3.86408 1.190201 -0.054944
H  -1.023202 -1.858994 1.372749
H  2.0670 -0.944763 1.16885
H  3.752044 -0.725072 1.552685
H  -2.864928 -0.54602 0.226901
H  -3.215419 -1.954347 -0.751821
H  2.783053 2.805654 1.489018
H  3.690344 1.57004 2.357921
H  1.9329 1.487042 2.298273
H  -1.838448 -4.16539 0.890943
H  -0.204874 -3.934797 0.288838
H  -1.573523 -3.914339 -0.831812
H  4.408852 -1.149419 -0.806744
H  2.718892 -1.354182 -1.264281
H  3.474916 -2.496575 -0.162996
H  -3.824089 -3.236429 1.337136
H  -4.747419 -1.747022 1.224333
H  -3.369496 -1.842444 2.315174
H  -1.69753 3.26168 -1.630066
H  -0.648922 3.303028 -0.219385
H  -3.004869 3.883948 0.357998
H  -3.556729 2.313863 -0.218421
H  -2.511963 2.421802 1.207409
elementType: S P O C H
totalener: -1683.31466088 hartree
nucrepener: 1587.06943175 hartree
electener: -3270.38409262 hartree
oneelecener: -5472.57256212 hartree
twoeener: 2202.18846950 hartree
cpcmener: -0.02296565 hartree
kineticenergy: 1678.54608088 hartree
xcener: -109.975107628985 hartree
chargesum: -0.0000000
charge: -0.212945 -0.194635 0.750234 -0.371368 -0.648094 0.095115 0.075104 -0.121790 -0.083499 -0.288858 -0.286982 -0.274410 -0.283626 0.049976 -0.265868 0.091775 0.084531 0.063242 0.089118 0.054507 0.068610 0.098237 0.101458 0.093507 0.102654 0.105495 0.100409 0.091543 0.069050 0.098567 0.087147 0.095747 0.085893 0.108885 0.089568 0.107106 0.089776 0.084822
qa: -0.2129 -0.1946 0.7502 -0.3714 -0.6481 0.0951 0.0751 -0.1218 -0.0835 -0.2889 -0.2870 -0.2744 -0.2836 0.0500 -0.2659 0.0918 0.0845 0.0632 0.0891 0.0545 0.0686 0.0982 0.1015 0.0935 0.1027 0.1055 0.1004 0.0915 0.0690 0.0986 0.0871 0.0957 0.0859 0.1089 0.0896 0.1071 0.0898 0.0848
va: 2.2953 2.2944 5.3586 2.0643 1.9146 3.7851 3.8291 3.8746 3.8995 3.9476 3.9325 3.9422 3.9565 3.8621 3.9197 1.0089 1.0373 1.0226 1.0077 1.0213 1.0198 1.0090 1.0028 1.0199 0.9986 1.0084 1.0021 1.0039 1.0128 1.0035 1.0005 1.0032 1.0000 0.9913 1.0075 1.0083 1.0024 1.0195
dispcorr: -0.018493035 hartree
energy: -1683.333153910337
dipole: -4.89952 5.06792 0.16840 -8.13952 8.03760 -0.10192 10.49380 -10.45408 0.03972
magnitude: 0.20080 au
magnitude: 0.51040 debye
