program: Orca
programVersion: 5.0.4
elementType: S S P O O C C C C C C C C C C H H H H H H H H H H H H H H H H H H H H H H H
charge: 0
multiplicity: 1
keywords: wb97x-d3
keywords: def2-TZVPP
keywords: def2/J RIJCOSX
keywords: DEFGRID2
keywords: scfconv7
keywords: smallprint printgap noloewdin
keywords: NOSOSCF
formula: C10H23O2PS2
InChI: InChI=1/C10H23O2PS2/c1-6-9(4)14-13(11,12-8-3)15-10(5)7-2/h9-10H,6-8H2,1-5H3
38 atoms
S  1.281516 0.399387 -0.86233
S  -1.792201 -0.453312 -0.567849
P  -0.284705 0.482234 0.499414
O  -0.793828 1.991346 0.616702
O  -0.000323 -0.061346 1.854768
C  2.793731 0.854871 0.099537
C  -1.184301 -2.207859 -0.548276
C  3.309505 -0.285555 0.966359
C  -2.206603 -3.083623 0.163235
C  2.627002 2.156321 0.861118
C  -0.922713 -2.651479 -1.974432
C  3.566504 -1.58441 0.222468
C  -2.394759 -2.761068 1.635067
C  -1.075317 2.847873 -0.509794
C  -2.559599 3.069789 -0.652913
H  3.501131 1.016401 -0.719245
H  -0.247669 -2.220956 0.014127
H  2.625792 -0.454086 1.799628
H  4.246382 0.067541 1.407475
H  -3.162897 -3.029768 -0.364715
H  -1.860484 -4.11618 0.058941
H  3.596787 2.464446 1.255153
H  1.952382 2.047547 1.710099
H  2.257166 2.957126 0.221756
H  -1.829426 -2.620696 -2.579797
H  -0.557489 -3.680044 -1.972635
H  -0.168195 -2.029466 -2.454553
H  4.051494 -2.311378 0.874202
H  4.218139 -1.427367 -0.63921
H  2.64118 -2.034296 -0.138071
H  -1.452383 -2.830922 2.180289
H  -3.093427 -3.462017 2.091865
H  -2.792872 -1.757134 1.783829
H  -0.64994 2.431024 -1.425202
H  -0.558999 3.786291 -0.310422
H  -2.990951 3.492709 0.253995
H  -2.733907 3.774797 -1.465982
H  -3.092057 2.149797 -0.895232
elementType: S P O C H
totalener: -1683.31511041 hartree
nucrepener: 1596.47674344 hartree
electener: -3279.79185385 hartree
oneelecener: -5491.17429828 hartree
twoeener: 2211.38244442 hartree
cpcmener: -0.02821361 hartree
kineticenergy: 1678.55389653 hartree
xcener: -109.979448093942 hartree
chargesum: -0.0000000
charge: -0.207014 -0.235221 0.751674 -0.364491 -0.648286 0.094339 0.098658 -0.124317 -0.100609 -0.298261 -0.268438 -0.267524 -0.277395 0.025492 -0.232791 0.100863 0.062230 0.073319 0.083796 0.076622 0.078976 0.108123 0.086168 0.103695 0.098843 0.099733 0.095398 0.094739 0.087591 0.072300 0.080844 0.099272 0.074504 0.099140 0.110646 0.092219 0.095985 0.079176
qa: -0.2070 -0.2352 0.7517 -0.3645 -0.6483 0.0943 0.0987 -0.1243 -0.1006 -0.2983 -0.2684 -0.2675 -0.2774 0.0255 -0.2328 0.1009 0.0622 0.0733 0.0838 0.0766 0.0790 0.1081 0.0862 0.1037 0.0988 0.0997 0.0954 0.0947 0.0876 0.0723 0.0808 0.0993 0.0745 0.0991 0.1106 0.0922 0.0960 0.0792
va: 2.2830 2.2813 5.4003 2.0799 1.9394 3.7897 3.8240 3.8775 3.8865 3.9376 3.9473 3.9444 3.9379 3.8287 3.9575 1.0090 1.0365 1.0255 1.0070 1.0119 1.0081 1.0027 1.0199 1.0083 1.0042 1.0028 1.0112 1.0054 1.0011 1.0090 1.0050 1.0071 1.0165 1.0068 0.9944 1.0034 1.0069 1.0084
dispcorr: -0.018691058 hartree
energy: -1683.333801468996
dipole: 4.71844 -4.03478 0.68367 -7.12962 7.40878 0.27916 -0.71765 -1.17942 -1.89708
magnitude: 2.03574 au
magnitude: 5.17444 debye
