program: Orca
programVersion: 5.0.4
elementType: S S P O O C C C C C C C C C C H H H H H H H H H H H H H H H H H H H H H H H
charge: 0
multiplicity: 1
keywords: wb97x-d3
keywords: def2-TZVPP
keywords: def2/J RIJCOSX
keywords: DEFGRID2
keywords: scfconv7
keywords: smallprint printgap noloewdin
keywords: NOSOSCF
formula: C10H23O2PS2
InChI: InChI=1/C10H23O2PS2/c1-6-9(4)14-13(11,12-8-3)15-10(5)7-2/h9-10H,6-8H2,1-5H3
38 atoms
S  1.64938 1.069029 -0.362636
S  -0.675506 -1.223642 -0.615622
P  -0.065551 0.369129 0.566376
O  -1.116137 1.556558 0.359737
O  0.061623 0.048013 2.012703
C  2.944817 -0.042752 0.369147
C  -2.052878 -1.899711 0.42929
C  4.249723 0.743327 0.423778
C  -3.230957 -2.238535 -0.474871
C  3.076763 -1.319042 -0.436946
C  -1.540623 -3.094543 1.209659
C  4.236504 1.936348 1.363477
C  -3.885892 -1.032238 -1.125346
C  -1.49206 2.078611 -0.929139
C  -2.833764 2.751194 -0.801233
H  2.621368 -0.266986 1.386783
H  -2.358406 -1.110196 1.118947
H  4.538802 1.051075 -0.585208
H  5.015254 0.034716 0.752317
H  -2.919932 -2.962368 -1.233642
H  -3.965172 -2.753801 0.151553
H  3.844469 -1.952183 0.01194
H  3.371586 -1.110566 -1.465712
H  2.148534 -1.888068 -0.4548
H  -2.337841 -3.492568 1.840366
H  -0.706781 -2.821072 1.854743
H  -1.209729 -3.892398 0.543683
H  3.933595 1.641083 2.369402
H  3.554641 2.717663 1.02765
H  5.230631 2.377824 1.434324
H  -4.770678 -1.329859 -1.688311
H  -3.212292 -0.525318 -1.817169
H  -4.20168 -0.305849 -0.374353
H  -1.537495 1.270119 -1.662684
H  -0.72988 2.789617 -1.255537
H  -2.80797 3.566099 -0.078071
H  -3.113292 3.170769 -1.767453
H  -3.608683 2.043885 -0.505551
elementType: S P O C H
totalener: -1683.31670917 hartree
nucrepener: 1568.97732193 hartree
electener: -3252.29403111 hartree
oneelecener: -5435.86952549 hartree
twoeener: 2183.57549438 hartree
cpcmener: -0.02775073 hartree
kineticenergy: 1678.54750172 hartree
xcener: -109.975811172912 hartree
chargesum: -0.0000000
charge: -0.221870 -0.212325 0.747983 -0.355752 -0.654176 0.077019 0.092949 -0.098996 -0.096122 -0.274986 -0.275116 -0.267144 -0.289789 0.002236 -0.249661 0.083040 0.071340 0.078661 0.080216 0.076606 0.078094 0.100864 0.093078 0.091464 0.099080 0.093818 0.092316 0.082489 0.076500 0.095543 0.104426 0.081338 0.085809 0.114452 0.121617 0.094750 0.091995 0.088251
qa: -0.2219 -0.2123 0.7480 -0.3558 -0.6542 0.0770 0.0929 -0.0990 -0.0961 -0.2750 -0.2751 -0.2671 -0.2898 0.0022 -0.2497 0.0830 0.0713 0.0787 0.0802 0.0766 0.0781 0.1009 0.0931 0.0915 0.0991 0.0938 0.0923 0.0825 0.0765 0.0955 0.1044 0.0813 0.0858 0.1145 0.1216 0.0948 0.0920 0.0883
va: 2.2845 2.2768 5.4044 2.0857 1.9459 3.8295 3.8026 3.8491 3.8562 3.9387 3.9427 3.9499 3.9567 3.8245 3.9598 1.0401 1.0403 1.0114 1.0071 1.0120 1.0076 1.0055 1.0070 1.0253 1.0040 1.0198 1.0053 1.0012 1.0110 1.0047 1.0067 0.9998 0.9957 0.9922 0.9933 1.0044 1.0048 1.0060
dispcorr: -0.017767680 hartree
energy: -1683.334476854077
dipole: -3.21544 2.87686 -0.33858 -4.04273 3.62884 -0.41388 -2.65379 0.97595 -1.67784
magnitude: 1.76099 au
magnitude: 4.47608 debye
