program: Orca
programVersion: 5.0.4
elementType: S S P O O C C C C C C C C C C H H H H H H H H H H H H H H H H H H H H H H H
charge: 0
multiplicity: 1
keywords: wb97x-d3
keywords: def2-TZVPP
keywords: def2/J RIJCOSX
keywords: DEFGRID2
keywords: scfconv7
keywords: smallprint printgap noloewdin
keywords: NOSOSCF
formula: C10H23O2PS2
InChI: InChI=1/C10H23O2PS2/c1-6-9(4)14-13(11,12-8-3)15-10(5)7-2/h9-10H,6-8H2,1-5H3
38 atoms
S  1.491453 1.326528 -0.340856
S  -0.996834 -0.563158 -1.054803
P  -0.141868 0.428138 0.557772
O  -1.074469 1.663677 0.953012
O  0.148612 -0.401735 1.758924
C  2.592781 -0.154365 -0.555306
C  -2.204311 -1.745906 -0.303069
C  3.926021 0.119686 0.127169
C  -1.523552 -3.004061 0.215874
C  2.736061 -0.461132 -2.03183
C  -3.117454 -1.091144 0.717778
C  3.838323 0.307327 1.631504
C  -0.709564 -3.752813 -0.824982
C  -1.557342 2.638277 0.005754
C  -2.862474 3.19558 0.509437
H  2.105073 -0.993071 -0.054844
H  -2.798934 -2.008882 -1.182854
H  4.40387 0.986458 -0.337731
H  4.569756 -0.7362 -0.095243
H  -0.901982 -2.758749 1.078313
H  -2.319519 -3.655629 0.588131
H  3.373807 -1.33785 -2.158124
H  3.193977 0.367109 -2.572719
H  1.772382 -0.679119 -2.489848
H  -3.911897 -1.791086 0.981562
H  -3.585844 -0.189068 0.325468
H  -2.590961 -0.838036 1.637654
H  3.360311 -0.548177 2.110936
H  3.269697 1.198129 1.898139
H  4.834181 0.413684 2.061747
H  -1.311153 -3.993032 -1.703804
H  -0.334081 -4.691027 -0.416211
H  0.152011 -3.173212 -1.158775
H  -1.695831 2.175815 -0.97396
H  -0.807588 3.42526 -0.092743
H  -3.627054 2.421127 0.573523
H  -2.751663 3.663513 1.487448
H  -3.21419 3.95649 -0.187146
elementType: S P O C H
totalener: -1683.31570619 hartree
nucrepener: 1590.44269715 hartree
electener: -3273.75840333 hartree
oneelecener: -5479.05307402 hartree
twoeener: 2205.29467068 hartree
cpcmener: -0.02764096 hartree
kineticenergy: 1678.55807118 hartree
xcener: -109.979657681427 hartree
chargesum: 0.0000000
charge: -0.224191 -0.208018 0.752187 -0.359472 -0.648830 0.089560 0.097209 -0.100594 -0.123506 -0.275339 -0.304798 -0.272880 -0.266225 0.008951 -0.242373 0.066244 0.099112 0.076572 0.079636 0.073711 0.082467 0.101106 0.100066 0.095636 0.108249 0.105394 0.087304 0.079989 0.075055 0.098573 0.086803 0.094148 0.072503 0.111006 0.114942 0.085996 0.091278 0.092533
qa: -0.2242 -0.2080 0.7522 -0.3595 -0.6488 0.0896 0.0972 -0.1006 -0.1235 -0.2753 -0.3048 -0.2729 -0.2662 0.0090 -0.2424 0.0662 0.0991 0.0766 0.0796 0.0737 0.0825 0.1011 0.1001 0.0956 0.1082 0.1054 0.0873 0.0800 0.0751 0.0986 0.0868 0.0941 0.0725 0.1110 0.1149 0.0860 0.0913 0.0925
va: 2.2765 2.2853 5.3962 2.0869 1.9371 3.8196 3.7762 3.8830 3.8833 3.9515 3.9376 3.9385 3.9442 3.8316 3.9660 1.0372 1.0098 1.0116 1.0081 1.0261 1.0074 1.0023 1.0053 1.0118 1.0033 1.0064 1.0215 1.0051 1.0157 1.0064 1.0015 1.0052 1.0082 0.9989 0.9910 1.0060 1.0035 1.0061
dispcorr: -0.018573003 hartree
energy: -1683.334279191000
dipole: 0.34827 -0.98474 -0.63647 -8.75387 8.73200 -0.02186 -1.75475 -0.08907 -1.84382
magnitude: 1.95070 au
magnitude: 4.95829 debye
