program: Orca
programVersion: 5.0.4
elementType: S S P O O C C C C C C C C C C H H H H H H H H H H H H H H H H H H H H H H H
charge: 0
multiplicity: 1
keywords: wb97x-d3
keywords: def2-TZVPP
keywords: def2/J RIJCOSX
keywords: DEFGRID2
keywords: scfconv7
keywords: smallprint printgap noloewdin
keywords: NOSOSCF
formula: C10H23O2PS2
InChI: InChI=1/C10H23O2PS2/c1-6-9(4)14-13(11,12-8-3)15-10(5)7-2/h9-10H,6-8H2,1-5H3
38 atoms
S  1.461105 -0.70338 -0.436088
S  -1.423768 -1.338957 0.913011
P  0.072307 0.08689 0.884785
O  -0.46011 1.378659 0.103859
O  0.523018 0.332827 2.283169
C  2.567243 0.697545 -0.943014
C  -2.039815 -1.374919 -0.834598
C  3.04507 1.569377 0.209434
C  -2.214935 -2.830899 -1.250464
C  1.973507 1.49271 -2.090682
C  -3.328824 -0.582863 -0.940221
C  3.827856 0.831923 1.281403
C  -0.922021 -3.621997 -1.343799
C  -1.25729 2.381495 0.774505
C  -1.175779 3.655765 -0.023454
H  3.424046 0.132169 -1.321613
H  -1.26919 -0.91709 -1.458384
H  2.20487 2.114347 0.64686
H  3.687106 2.333967 -0.237327
H  -2.917483 -3.324624 -0.572715
H  -2.701584 -2.81835 -2.22998
H  2.732608 2.172567 -2.482039
H  1.120525 2.092782 -1.780193
H  1.658932 0.844111 -2.907184
H  -3.683056 -0.59882 -1.972663
H  -3.191342 0.458391 -0.65226
H  -4.111396 -1.009132 -0.311501
H  4.191507 1.529037 2.036391
H  4.69533 0.326746 0.853911
H  3.225209 0.080817 1.790226
H  -1.119008 -4.636653 -1.690566
H  -0.417405 -3.696358 -0.380297
H  -0.227837 -3.160872 -2.047676
H  -0.885482 2.536242 1.788089
H  -2.286179 2.022731 0.840278
H  -1.548123 3.520128 -1.038822
H  -1.78871 4.417587 0.458206
H  -0.152669 4.029139 -0.071057
elementType: S P O C H
totalener: -1683.31560402 hartree
nucrepener: 1598.49698361 hartree
electener: -3281.81258763 hartree
oneelecener: -5494.82613683 hartree
twoeener: 2213.01354920 hartree
cpcmener: -0.02959642 hartree
kineticenergy: 1678.54007619 hartree
xcener: -109.974412240903 hartree
chargesum: -0.0000000
charge: -0.209213 -0.207077 0.741739 -0.340761 -0.663374 0.094017 0.073886 -0.115015 -0.098339 -0.281302 -0.285927 -0.269025 -0.266990 0.019308 -0.257726 0.095700 0.071697 0.056823 0.089643 0.077298 0.077977 0.102259 0.087654 0.098053 0.100325 0.102168 0.096210 0.097655 0.088113 0.065036 0.101897 0.073180 0.076651 0.114711 0.107347 0.092211 0.103777 0.089411
qa: -0.2092 -0.2071 0.7417 -0.3408 -0.6634 0.0940 0.0739 -0.1150 -0.0983 -0.2813 -0.2859 -0.2690 -0.2670 0.0193 -0.2577 0.0957 0.0717 0.0568 0.0896 0.0773 0.0780 0.1023 0.0877 0.0981 0.1003 0.1022 0.0962 0.0977 0.0881 0.0650 0.1019 0.0732 0.0767 0.1147 0.1073 0.0922 0.1038 0.0894
va: 2.2751 2.3093 5.3916 2.0585 1.9343 3.8003 3.8107 3.8770 3.8643 3.9492 3.9704 3.9494 3.9245 3.8256 3.9376 1.0104 1.0394 1.0291 1.0058 1.0113 1.0068 1.0034 1.0109 1.0097 1.0034 1.0028 1.0046 1.0033 1.0018 1.0241 1.0064 1.0154 1.0054 1.0087 0.9904 1.0011 1.0076 1.0018
dispcorr: -0.019516407 hartree
energy: -1683.335120428986
dipole: -0.28833 -0.46493 -0.75326 7.95207 -6.83285 1.11922 -13.18436 10.56047 -2.62389
magnitude: 2.95040 au
magnitude: 7.49932 debye
