program: Orca
programVersion: 5.0.4
elementType: S S P O O C C C C C C C C C C H H H H H H H H H H H H H H H H H H H H H H H
charge: 0
multiplicity: 1
keywords: wb97x-d3
keywords: def2-TZVPP
keywords: def2/J RIJCOSX
keywords: DEFGRID2
keywords: scfconv7
keywords: smallprint printgap noloewdin
keywords: NOSOSCF
formula: C10H23O2PS2
InChI: InChI=1/C10H23O2PS2/c1-6-9(4)14-13(11,12-8-3)15-10(5)7-2/h9-10H,6-8H2,1-5H3
38 atoms
S  1.518634 -0.10716 -0.631229
S  -1.72925 -0.65383 -0.815442
P  -0.290585 0.42937 0.213267
O  -0.495007 1.912231 -0.356214
O  -0.355298 0.301807 1.696394
C  2.687512 0.782082 0.507754
C  -1.936005 -2.149906 0.256295
C  3.841292 1.290714 -0.351636
C  -3.253876 -2.789215 -0.177557
C  3.116938 -0.14432 1.628239
C  -0.744099 -3.077513 0.136992
C  4.849492 2.104233 0.447946
C  -3.619213 -4.001919 0.667933
C  -1.609903 2.726252 0.078474
C  -1.146009 4.155567 0.17927
H  2.151687 1.641951 0.91578
H  -2.036501 -1.787053 1.280216
H  3.437614 1.909988 -1.154878
H  4.345492 0.445035 -0.827766
H  -4.051922 -2.047377 -0.101587
H  -3.192644 -3.081299 -1.229705
H  3.745597 0.389811 2.342134
H  3.687734 -0.990399 1.243308
H  2.259778 -0.531851 2.175755
H  -0.871096 -3.938111 0.794742
H  0.184491 -2.588147 0.428094
H  -0.630452 -3.443899 -0.883947
H  5.374642 1.500563 1.187816
H  4.365389 2.929904 0.972036
H  5.601086 2.531088 -0.215979
H  -2.933624 -4.834757 0.513334
H  -4.618622 -4.352531 0.410475
H  -3.618912 -3.759485 1.73214
H  -1.98833 2.376072 1.04028
H  -2.409087 2.621399 -0.656282
H  -1.985936 4.783843 0.476412
H  -0.361123 4.267343 0.927562
H  -0.774318 4.525169 -0.776593
elementType: S P O C H
totalener: -1683.31633651 hartree
nucrepener: 1535.10689541 hartree
electener: -3218.42323191 hartree
oneelecener: -5368.42398919 hartree
twoeener: 2150.00075727 hartree
cpcmener: -0.02436994 hartree
kineticenergy: 1678.53263976 hartree
xcener: -109.969678187528 hartree
chargesum: 0.0000000
charge: -0.189789 -0.198513 0.755889 -0.367852 -0.655422 0.076436 0.059299 -0.093477 -0.096244 -0.292807 -0.280542 -0.287952 -0.290321 0.037004 -0.246281 0.078186 0.085861 0.080937 0.075705 0.083661 0.080047 0.104968 0.095011 0.092985 0.105646 0.083044 0.094457 0.086788 0.086660 0.096740 0.087491 0.096820 0.088098 0.097197 0.102616 0.091060 0.086852 0.089744
qa: -0.1898 -0.1985 0.7559 -0.3679 -0.6554 0.0764 0.0593 -0.0935 -0.0962 -0.2928 -0.2805 -0.2880 -0.2903 0.0370 -0.2463 0.0782 0.0859 0.0809 0.0757 0.0837 0.0800 0.1050 0.0950 0.0930 0.1056 0.0830 0.0945 0.0868 0.0867 0.0967 0.0875 0.0968 0.0881 0.0972 0.1026 0.0911 0.0869 0.0897
va: 2.2849 2.3147 5.3690 2.0803 1.9192 3.8473 3.8726 3.8722 3.8443 3.9507 3.9318 3.9568 3.9573 3.8624 3.9611 1.0375 1.0394 1.0157 1.0113 1.0158 1.0109 0.9994 1.0042 1.0231 1.0020 1.0253 1.0073 0.9998 0.9987 1.0036 0.9989 1.0036 0.9990 0.9986 0.9933 1.0067 1.0060 1.0025
dispcorr: -0.016350528 hartree
energy: -1683.332687035183
dipole: 5.38219 -5.45283 -0.07064 -2.40793 2.59051 0.18258 7.29871 -7.53945 -0.24074
magnitude: 0.31029 au
magnitude: 0.78869 debye
