program: Orca
programVersion: 5.0.4
elementType: S S P O O C C C C C C C C C C H H H H H H H H H H H H H H H H H H H H H H H
charge: 0
multiplicity: 1
keywords: wb97x-d3
keywords: def2-TZVPP
keywords: def2/J RIJCOSX
keywords: DEFGRID2
keywords: scfconv7
keywords: smallprint printgap noloewdin
keywords: NOSOSCF
formula: C10H23O2PS2
InChI: InChI=1/C10H23O2PS2/c1-6-9(4)14-13(11,12-8-3)15-10(5)7-2/h9-10H,6-8H2,1-5H3
38 atoms
S  1.597706 1.150193 -0.543724
S  -0.617179 -1.271577 -0.791756
P  -0.204018 0.477108 0.230223
O  -1.271138 1.48616 -0.406139
O  -0.234201 0.371444 1.716849
C  2.820331 0.399659 0.629031
C  -2.168375 -1.806065 0.079495
C  4.116119 1.185288 0.438994
C  -3.066141 -2.446883 -0.974425
C  2.972639 -1.087661 0.382515
C  -1.82129 -2.723782 1.235662
C  5.205667 0.744493 1.406972
C  -4.406242 -2.888646 -0.403143
C  -1.465501 2.815093 0.133308
C  -2.943364 3.10333 0.171226
H  2.438938 0.582366 1.634511
H  -2.659578 -0.903704 0.450388
H  3.914101 2.248088 0.588053
H  4.469781 1.07121 -0.589568
H  -3.236344 -1.727147 -1.777307
H  -2.556465 -3.304729 -1.422729
H  3.673784 -1.518183 1.098561
H  3.348936 -1.284976 -0.621987
H  2.02933 -1.619026 0.502291
H  -1.361109 -3.647764 0.882929
H  -2.721187 -2.986569 1.793873
H  -1.134907 -2.244768 1.93139
H  6.068947 1.405285 1.32991
H  5.552733 -0.268215 1.203712
H  4.855884 0.777889 2.440172
H  -4.303273 -3.721995 0.291495
H  -5.071413 -3.21254 -1.203707
H  -4.900104 -2.071338 0.125634
H  -0.942072 3.516072 -0.51757
H  -1.031812 2.893179 1.131666
H  -3.392754 3.020713 -0.818587
H  -3.463387 2.42654 0.8493
H  -3.10196 4.122072 0.525199
elementType: S P O C H
totalener: -1683.31625735 hartree
nucrepener: 1536.20576308 hartree
electener: -3219.52202043 hartree
oneelecener: -5370.62113869 hartree
twoeener: 2151.09911826 hartree
cpcmener: -0.02438733 hartree
kineticenergy: 1678.53430681 hartree
xcener: -109.970180889878 hartree
chargesum: 0.0000000
charge: -0.196681 -0.189265 0.751470 -0.366212 -0.654984 0.053210 0.075357 -0.094271 -0.091721 -0.279414 -0.292029 -0.290642 -0.290147 0.038953 -0.247438 0.087099 0.077289 0.082951 0.079836 0.081251 0.075483 0.106071 0.094648 0.082208 0.094883 0.104634 0.093564 0.096983 0.087744 0.087946 0.087266 0.096968 0.087291 0.104579 0.095315 0.089874 0.086951 0.092981
qa: -0.1967 -0.1893 0.7515 -0.3662 -0.6550 0.0532 0.0754 -0.0943 -0.0917 -0.2794 -0.2920 -0.2906 -0.2901 0.0390 -0.2474 0.0871 0.0773 0.0830 0.0798 0.0813 0.0755 0.1061 0.0946 0.0822 0.0949 0.1046 0.0936 0.0970 0.0877 0.0879 0.0873 0.0970 0.0873 0.1046 0.0953 0.0899 0.0870 0.0930
va: 2.3143 2.2863 5.3750 2.0794 1.9186 3.8759 3.8547 3.8436 3.8671 3.9289 3.9491 3.9564 3.9574 3.8597 3.9566 1.0398 1.0361 1.0162 1.0111 1.0156 1.0115 1.0022 1.0071 1.0282 1.0043 0.9992 1.0244 1.0035 0.9990 0.9990 0.9993 1.0037 0.9983 0.9927 1.0003 1.0029 1.0060 1.0069
dispcorr: -0.016409903 hartree
energy: -1683.332667255788
dipole: -2.28810 2.11130 -0.17680 -6.56763 6.72283 0.15520 6.59555 -6.86312 -0.26757
magnitude: 0.35629 au
magnitude: 0.90562 debye
