program: Orca
programVersion: 5.0.4
elementType: S S P O O C C C C C C C C C C H H H H H H H H H H H H H H H H H H H H H H H
charge: 0
multiplicity: 1
keywords: wb97x-d3
keywords: def2-TZVPP
keywords: def2/J RIJCOSX
keywords: DEFGRID2
keywords: scfconv7
keywords: smallprint printgap noloewdin
keywords: NOSOSCF
formula: C10H23O2PS2
InChI: InChI=1/C10H23O2PS2/c1-6-9(4)14-13(11,12-8-3)15-10(5)7-2/h9-10H,6-8H2,1-5H3
38 atoms
S  1.495543 1.106821 -0.573789
S  -0.820514 -1.226071 -0.67635
P  -0.297747 0.523798 0.289212
O  -1.346398 1.56886 -0.322529
O  -0.272643 0.446114 1.777442
C  2.735694 0.361985 0.584588
C  -2.306069 -1.724286 0.326706
C  4.054187 1.074708 0.290098
C  -3.352305 -2.300799 -0.621763
C  2.810424 -1.142537 0.419685
C  -1.887186 -2.668008 1.436973
C  5.172456 0.638648 1.227356
C  -2.935492 -3.560803 -1.363739
C  -1.410859 2.930924 0.161421
C  -2.844898 3.387936 0.102849
H  2.410019 0.618727 1.593606
H  -2.716132 -0.810449 0.759217
H  3.906592 2.152368 0.387941
H  4.350357 0.888094 -0.746092
H  -4.239019 -2.51257 -0.017453
H  -3.645409 -1.529148 -1.33621
H  3.522548 -1.562991 1.13092
H  3.13415 -1.413693 -0.585808
H  1.851047 -1.622376 0.609196
H  -1.19278 -2.185545 2.122808
H  -1.407752 -3.567665 1.052548
H  -2.765683 -2.972859 2.00964
H  4.880659 0.748604 2.273102
H  6.058744 1.252359 1.066332
H  5.463895 -0.399187 1.06823
H  -3.742003 -3.8988 -2.014369
H  -2.702975 -4.380289 -0.683528
H  -2.061654 -3.39625 -1.997633
H  -0.774586 3.546314 -0.476017
H  -1.028496 2.992558 1.181808
H  -3.243885 3.326295 -0.909696
H  -3.478718 2.79896 0.765558
H  -2.901965 4.428926 0.420608
elementType: S P O C H
totalener: -1683.31603446 hartree
nucrepener: 1541.89716372 hartree
electener: -3225.21319818 hartree
oneelecener: -5382.08893894 hartree
twoeener: 2156.87574076 hartree
cpcmener: -0.02438395 hartree
kineticenergy: 1678.53466455 hartree
xcener: -109.971535783096 hartree
chargesum: -0.0000000
charge: -0.198671 -0.198302 0.758251 -0.366701 -0.655572 0.057578 0.085940 -0.096638 -0.112306 -0.278873 -0.299207 -0.290520 -0.268658 0.035932 -0.245549 0.086854 0.083891 0.083575 0.080414 0.078200 0.083582 0.106010 0.094244 0.081729 0.095379 0.094529 0.105031 0.088303 0.096695 0.087590 0.097847 0.087903 0.075130 0.101746 0.097688 0.089093 0.087374 0.090489
qa: -0.1987 -0.1983 0.7583 -0.3667 -0.6556 0.0576 0.0859 -0.0966 -0.1123 -0.2789 -0.2992 -0.2905 -0.2687 0.0359 -0.2455 0.0869 0.0839 0.0836 0.0804 0.0782 0.0836 0.1060 0.0942 0.0817 0.0954 0.0945 0.1050 0.0883 0.0967 0.0876 0.0978 0.0879 0.0751 0.1017 0.0977 0.0891 0.0874 0.0905
va: 2.3122 2.2913 5.3688 2.0831 1.9208 3.8722 3.8505 3.8451 3.9026 3.9317 3.9557 3.9569 3.9327 3.8625 3.9618 1.0393 1.0326 1.0159 1.0110 1.0080 1.0153 1.0022 1.0072 1.0258 1.0231 1.0001 1.0023 0.9989 1.0035 0.9991 1.0037 0.9982 1.0081 0.9933 0.9982 1.0029 1.0057 1.0066
dispcorr: -0.016479540 hartree
energy: -1683.332513996517
dipole: 0.94148 -1.07349 -0.13201 -7.54772 7.67730 0.12958 4.65495 -4.90277 -0.24783
magnitude: 0.30925 au
magnitude: 0.78605 debye
