program: Orca
programVersion: 5.0.4
elementType: S S P O O C C C C C C C C C C H H H H H H H H H H H H H H H H H H H H H H H
charge: 0
multiplicity: 1
keywords: wb97x-d3
keywords: def2-TZVPP
keywords: def2/J RIJCOSX
keywords: DEFGRID2
keywords: scfconv7
keywords: smallprint printgap noloewdin
keywords: NOSOSCF
formula: C10H23O2PS2
InChI: InChI=1/C10H23O2PS2/c1-6-9(4)14-13(11,12-8-3)15-10(5)7-2/h9-10H,6-8H2,1-5H3
38 atoms
S  1.846925 1.135094 -0.671962
S  -0.51749 -1.153392 -0.905064
P  -0.022386 0.631858 0.045699
O  -0.823569 1.807414 -0.685659
O  -0.17069 0.54278 1.527023
C  2.844076 -0.252012 0.04956
C  -1.281284 -2.165424 0.443679
C  3.859758 0.302363 1.038511
C  -2.712238 -1.74373 0.7479
C  3.486572 -1.020355 -1.088768
C  -1.15447 -3.615216 0.00387
C  3.253429 0.95363 2.268018
C  -3.694673 -1.90585 -0.398986
C  -2.264011 1.900983 -0.617585
C  -2.726027 2.641542 0.612471
H  2.151525 -0.910909 0.579093
H  -0.66519 -2.011507 1.329035
H  4.523152 1.003406 0.524582
H  4.487841 -0.53827 1.347753
H  -3.041657 -2.349682 1.597863
H  -2.716236 -0.709669 1.099792
H  2.7368 -1.431343 -1.763906
H  4.068305 -1.851199 -0.685899
H  4.162067 -0.390367 -1.66895
H  -1.643556 -3.809847 -0.95082
H  -1.624123 -4.257095 0.751212
H  -0.110763 -3.91415 -0.084137
H  2.663062 1.834147 2.013457
H  4.036817 1.273008 2.955565
H  2.60536 0.260027 2.805667
H  -3.801319 -2.947606 -0.703191
H  -3.391915 -1.33247 -1.276641
H  -4.682735 -1.552495 -0.103995
H  -2.706477 0.903003 -0.669455
H  -2.554338 2.431966 -1.522719
H  -2.264728 3.626598 0.682268
H  -3.805534 2.783825 0.551226
H  -2.515576 2.091824 1.52918
elementType: S P O C H
totalener: -1683.31574122 hartree
nucrepener: 1584.78306675 hartree
electener: -3268.09880797 hartree
oneelecener: -5467.66279092 hartree
twoeener: 2199.56398295 hartree
cpcmener: -0.02599905 hartree
kineticenergy: 1678.54690563 hartree
xcener: -109.976698211275 hartree
chargesum: -0.0000000
charge: -0.202198 -0.208301 0.750955 -0.358476 -0.651262 0.072520 0.093475 -0.097116 -0.140651 -0.267799 -0.299571 -0.278270 -0.276763 0.057643 -0.250627 0.061590 0.092330 0.075943 0.077572 0.090843 0.073329 0.094653 0.098890 0.097745 0.099767 0.103061 0.108827 0.072086 0.099249 0.081331 0.095555 0.075236 0.100159 0.072353 0.114934 0.094405 0.098493 0.078093
qa: -0.2022 -0.2083 0.7510 -0.3585 -0.6513 0.0725 0.0935 -0.0971 -0.1407 -0.2678 -0.2996 -0.2783 -0.2768 0.0576 -0.2506 0.0616 0.0923 0.0759 0.0776 0.0908 0.0733 0.0947 0.0989 0.0977 0.0998 0.1031 0.1088 0.0721 0.0992 0.0813 0.0956 0.0752 0.1002 0.0724 0.1149 0.0944 0.0985 0.0781
va: 2.2876 2.2957 5.3837 2.1026 1.9153 3.8332 3.8170 3.8796 3.9074 3.9492 3.9462 3.9370 3.9214 3.8862 3.9231 1.0362 1.0326 1.0118 1.0074 1.0096 1.0108 1.0139 1.0026 1.0033 0.9965 0.9994 1.0085 1.0181 1.0076 1.0051 0.9984 1.0089 1.0040 0.9928 0.9925 1.0062 1.0061 1.0185
dispcorr: -0.018724904 hartree
energy: -1683.334466120196
dipole: -5.18578 4.60588 -0.57990 -10.51300 9.18699 -1.32601 7.11625 -7.55448 -0.43823
magnitude: 1.51216 au
magnitude: 3.84360 debye
