program: Orca
programVersion: 5.0.4
elementType: S S P O O C C C C C C C C C C H H H H H H H H H H H H H H H H H H H H H H H
charge: 0
multiplicity: 1
keywords: wb97x-d3
keywords: def2-TZVPP
keywords: def2/J RIJCOSX
keywords: DEFGRID2
keywords: scfconv7
keywords: smallprint printgap noloewdin
keywords: NOSOSCF
formula: C10H23O2PS2
InChI: InChI=1/C10H23O2PS2/c1-6-9(4)14-13(11,12-8-3)15-10(5)7-2/h9-10H,6-8H2,1-5H3
38 atoms
S  1.621374 1.059897 -0.663895
S  -0.611675 -1.345087 -0.79768
P  -0.19831 0.455937 0.125518
O  -1.23322 1.44424 -0.593534
O  -0.255345 0.445306 1.61487
C  2.808376 0.471861 0.629079
C  -2.182643 -1.817718 0.074326
C  4.0912 1.270116 0.407219
C  -3.07731 -2.492311 -0.96141
C  3.00103 -1.028646 0.547278
C  -1.859449 -2.686287 1.27448
C  5.144905 0.979325 1.466692
C  -4.43864 -2.871906 -0.395584
C  -1.390842 2.802008 -0.117378
C  -2.601222 2.919583 0.772826
H  2.380735 0.750189 1.593132
H  -2.664625 -0.892953 0.39929
H  3.854605 2.336235 0.423639
H  4.49552 1.051007 -0.585022
H  -3.21599 -1.812626 -1.804231
H  -2.579442 -3.383923 -1.353531
H  3.676725 -1.365672 1.334304
H  3.427348 -1.319369 -0.413608
H  2.0626 -1.566373 0.679493
H  -1.398463 -3.626671 0.969588
H  -2.769036 -2.920737 1.829457
H  -1.18096 -2.180484 1.959179
H  5.998596 1.645132 1.341002
H  5.518143 -0.042722 1.408722
H  4.749623 1.13579 2.471776
H  -4.36862 -3.651464 0.362901
H  -5.086335 -3.246669 -1.188251
H  -4.93422 -2.010085 0.054842
H  -1.499962 3.413347 -1.011935
H  -0.487863 3.1372 0.39826
H  -3.506182 2.596481 0.258254
H  -2.488757 2.333801 1.684754
H  -2.73476 3.963126 1.058897
elementType: S P O C H
totalener: -1683.31629310 hartree
nucrepener: 1541.15925949 hartree
electener: -3224.47555259 hartree
oneelecener: -5380.54993676 hartree
twoeener: 2156.07438417 hartree
cpcmener: -0.02407001 hartree
kineticenergy: 1678.54059705 hartree
xcener: -109.971254034107 hartree
chargesum: 0.0000000
charge: -0.198806 -0.189534 0.748069 -0.370446 -0.653485 0.058025 0.075311 -0.095916 -0.091351 -0.279491 -0.289397 -0.289038 -0.289517 0.050933 -0.253420 0.086661 0.076006 0.082568 0.080291 0.080879 0.076029 0.105524 0.093987 0.082846 0.095151 0.104134 0.092927 0.096710 0.087189 0.087608 0.086912 0.097003 0.086943 0.108732 0.089195 0.089921 0.080823 0.100027
qa: -0.1988 -0.1895 0.7481 -0.3704 -0.6535 0.0580 0.0753 -0.0959 -0.0914 -0.2795 -0.2894 -0.2890 -0.2895 0.0509 -0.2534 0.0867 0.0760 0.0826 0.0803 0.0809 0.0760 0.1055 0.0940 0.0828 0.0952 0.1041 0.0929 0.0967 0.0872 0.0876 0.0869 0.0970 0.0869 0.1087 0.0892 0.0899 0.0808 0.1000
va: 2.3106 2.2874 5.3741 2.0675 1.9133 3.8610 3.8591 3.8500 3.8708 3.9363 3.9491 3.9554 3.9583 3.8587 3.9389 1.0410 1.0338 1.0158 1.0107 1.0155 1.0113 1.0021 1.0069 1.0257 1.0044 0.9995 1.0239 1.0034 0.9996 0.9991 0.9997 1.0035 0.9984 0.9924 1.0073 1.0030 1.0175 1.0081
dispcorr: -0.016664591 hartree
energy: -1683.332957687834
dipole: -1.96474 1.82009 -0.14465 -5.68133 5.86188 0.18054 8.80975 -9.01456 -0.20481
magnitude: 0.30898 au
magnitude: 0.78536 debye
